km4city, the DISIT Knowledge Model for City and Mobility
type: Ontology
imports: iot-lite#
imports: ssn
imports: all
imports: systems
imports: v1.1.2
imports: bot-0.3.2
contributor: Municipality of Florence, Tuscany Region
creator: DISIT lab: info@disit.org, km4city@disit.org
creator: Pierfrancesco Bellini, Marco Fanfani, Paolo Nesi, Mirco Soderi
description: A Knowledge Model to describe a smart city, that interconnect data from infomobility service, Open Data and other source
license: it
publisher: DISIT Lab, University of Florence, Italy, http://www.km4city.org
rights: The Knowledge Model for the City - km4city - is available under Creative Commons Attribution-ShareAlike 3.0 Unported license
subject: Ontology, Semantic SEO, RDFa, Linked Data, RDF, Semantic Web, Smart Recommender Systems, Smart City, Transportation Network, Smart Mobility, Citizens Services, Semantic Model, knowledge model
preferred namespace prefix: km4c
comment: Km4city permette l'interconnessione, la memorizzazione e la successiva interrogazione, di molti dati provenienti da differenti fonti, quali i vari portali della regione toscana (MIIC, muoversi in toscana, osservatorio dei trasporti) o gli stessi Open Data e Linked Data messi a disposizione dai singoli comuni (principalmente Firenze). Si tratta quindi di un'ontologia di notevoli dimensioni, che conviene pertanto suddividere in macroclassi, e per la precisione, attualmente, sono state individuate le seguenti macroclassi: 1. Amministrazione: la prima macroclasse che è possibile individuare, le cui classi principali sono PA, Municipality, Province, Region, Resolution. 2. Stradario: formata dalle classi Road, Node, RoadElement, AdminidtrativeRoad, Milestone, StreetNumber, RoadLink, Junction, Entry, EntryRule e Maneuver. 3. Punti di Interesse: comprende tutti i servizi, le attività, che possono essere utili al cittadino e che quindi quest'ultimo può aver necessità di ricercare e di raggiungere. La classificazione dei singoli servizi e attività si baserà sulla classificazione precedentemente adottata dalla Regione Toscana. Sono inoltre inclusi in questa macroclasse le Digital Location e gli eventi programmati (dati Real Time) del comune di Firenze 4. Trasporto Pubblico Locale: attualmente disponiamo dell'accesso ai dati relativi agli orari programmati delle principali aziende TPL, al grafo ferroviario, e ai dati relativi al tempo reale dell'ATAF. Tale macroclasse è quindi formata dalle classi TPLLine, Ride, Route, AVMRecord, RouteSection, BusStopForeast, Lot, BusStop, RouteLink, TPLJunction. 5. Sensoristica: anche la macroclasse relativa ai dati provenienti da sensori è in via di sviluppo. Attualmente sono stati integrati nell'ontologia i dati raccolti da vari sensori installati lungo alcune strade di Firenze e dintorni, e quelli relativi ai posti liberi nei principali parcheggi dell'intera regione; è già presente anche la parte relativa agli eventi/emergenze, dove però at… @it
comment: The km4city knowledge model enables the description of smart cities, leveraging interconnection, storage and interrogation of data from many different sources, such as various portals of the Tuscan region (MIIC, Muoversi in Toscana, Osservatorio dei Trasporti), Open Data and Linked Data, provided by individual municipalities (mainly Florence). It is therefore evident that the ontology will be built, will not be small, and so it may be helpful to view it as consisting of various macro classes, and to be precise, at present, the following macro-categories have been identified: 1. Administration: the first macroclass that is possible to discover, whose main classes are PA, Municipality, Province, Region, Resolution; 2. Street Guide: the main classes of this macroclass are Road, RoadElement, AdministrativeRoad, Milestone, StreetNumber, RoadLink, Junction, Entry, Node, EntryRule and Maneuver; 3. Points of Interest: includes all services, activities, which may be useful to the citizen, and that may have the need to reach. The classification of individual services and activities will be based on classification previously adopted by the Tuscany Region. Digital location and scheduled events (real time data), from the municipality of Florence, are also included in this macroclass. In general, all the classes that specialize the class Service belong to this macroclass; 4. Local Public Transport: currently we have access to data relating to scheduled times of the leading LPT, the graph rail, and real-time data relating to ATAF services. This macroclass is then formed by many classes like TPLLine, Ride, Route, AVMRecord, RouteSection, BusStopForeast, Lot, BusStop, RouteLink, TPLJunction. 5. Sensors: the macroclass relative to data coming from sensors is developing. Currently in the ontology have been integrated data collected by various sensors installed along some roads of Florence and in that neighborhood, and those relating to free places in the major parks of the whole regio…
label: km4city: the DISIT Knowledge Model for City and Mobility
version info: V 1.6.8 RDFSPlus Adaptation, Release 2024-07-10

Name
range: string
type: DatatypeProperty
comment: La proprietà indica il nome dell'ente pubblico. @it
comment: The property indicates the name of the PA.
label: Nome @it

Location
type: ObjectProperty
domain: Event
range: Place
comment: Property of the schema.org ontology.
comment: Proprietà dell'ontologia schema.org. @it
label: Locazione @it

Access to element
type: ObjectProperty
inverse of: Has rule
domain: Entry Rule
range: Road element
comment: An entry rule refers to a specific Road element.
comment: Una regola di accesso si riferisce ad uno specifico elemento stradale. @it
label: Accede all'elemento @it

Approved by PA
type: ObjectProperty
inverse of: Has resolution
domain: Resolution
range: Public Administration
comment: Collega una delibera all'ente pubblico che la ha emanata. @it
comment: To connect a resolution to the municipality that have approved it.
label: Approvato dalla PA @it

Arranged on road
type: ObjectProperty
domain: Beacon
range: Road
comment: Collega il lampione alla strada su cui è installato. @it
comment: To connect each beacon to the road in which it is installed.
label: Installato nella strada @it

At bus stop
type: ObjectProperty
inverse of: Has forecast
domain: BusStop Forecast
range: Bus Stop
comment: Each forecast refers to a specific bus stop.
comment: Ogni previsione si riferisce ad una specifica fermata. @it
label: Alla fermata @it

Begins at junction
type: ObjectProperty
domain: RouteLink
range: Route Junction
comment: Ciascun tratto della linea ha una giunzione di inizio e una giunzione di fine. @it
comment: Each routeLink, has a beginning and an end junction.
label: Inizia alla giunzione @it

Belong to element
type: ObjectProperty
domain: Entry
range: Road element
comment: Questa proprietà indica il segmento stradale su cui si trova l'accesso. @it
comment: This property indicates the segment of road where an entry point of a street number is located.
label: Appartiene al segmento stradale @it

Belong to municipality
type: ObjectProperty
inverse of: Has district
domain: District
range: Municipality Administration
comment: A municipality can be divided in districts.
comment: Un comune può essere suddiviso in frazioni o quartieri. @it
label: Appartiene al comune @it

Belong to road
type: ObjectProperty
inverse of: Has street number
domain: Street Number
range: Road
comment: Each road has street numbers.
comment: Ogni strada ha i numeri civici. @it
label: Appartiene alla strada @it

Coincide with
type: ObjectProperty
domain: Road
range: Administrative Road
comment: Non c'è una corrispondenza esatta tra toponimi ed estese amministrative. @it
comment: There is no exact match between Road and AdministrativeRoad.
label: Coincide con @it

Compose direction
type: ObjectProperty
inverse of: Consist of element
domain: Railway Element
range: Railway Direction
comment: A railway Direction is composed by more railway element.
comment: Una direzione ferroviaria è formata da diversi elementi ferroviari. @it
label: Compone direttrice @it

Compose section
type: ObjectProperty
inverse of: Is composed by element
domain: Railway Element
range: Railway Section
comment: A railway Section is composed by more railway element.
comment: Una sezione ferroviaria è formata da più elementi ferroviari. @it
label: Compone sezione @it

Concern line
type: ObjectProperty
domain: AVM Record
range: Bus Line
comment: An AVMrecord concert to a unique line.
comment: Una rilevazione AVM si riferisce ad una specifica linea del TPL. @it
label: Riguarda la linea @it

Concerning node
type: ObjectProperty
domain: Maneuver
range: Node
comment: A maneuver takes place in correspondence of a node.
comment: Una manovra è eseguita in corrispondenza di un nodo. @it
label: Riguarda il nodo @it

Consist of element
type: ObjectProperty
domain: Railway Direction
range: Railway Element
comment: A railway Direction is composed by more railway element.
comment: Una direzione ferroviaria è formata da più elementi ferroviari. @it
label: Formato da elemento @it

Contains element
type: ObjectProperty
inverse of: Is part of Road
domain: Road
range: Road element
comment: A road is formed by more elements road.
comment: Una strada è formata da più elementi stradali. @it
label: Contiene elemento @it

Contains industrial site
type: ObjectProperty
inverse of: Is part of industrial area
domain: IndustrialArea
range: Site
comment: An industrial area is made up of one or more industrial sites.
comment: Un'area industriale è formata da più siti industriali. @it
label: Contiene sito industriale @it

Correspond to junction
type: ObjectProperty
domain: Class
  union of: Goods Yard
  union of: Train Station
range: Railway Junction
comment: Le stazioni ferroviarie e gli scali merci si trovano esattamente in corrispondenza di una giunzione ferroviaria. @it
comment: Train station and good yard are located precisely on a junction.
label: Corrisponde alla giunzione @it

Corresponds to
type: ObjectProperty
domain: Administrative Road
range: Road
comment: Non c'è una corrispondenza esatta tra toponimi ed estese amministrative. @it
comment: There is no exact match between Road and AdministrativeRoad.
label: Corrisponde a @it

End at junction
type: ObjectProperty
domain: Railway Element
range: Railway Junction
comment: A railway element is delimited by two junctions.
comment: Un elemento ferroviario è delimitato da due giunzioni ferroviarie. @it
label: Termina alla giunzione @it

Ending junction
type: ObjectProperty
domain: RoadLink
range: Junction
comment: A road link is delimited by two junctions.
comment: Un tratto lineare di strada è delimitato da due giunzioni. @it
label: Giunzione di fine @it

Ends at node
type: ObjectProperty
domain: Road element
range: Node
comment: A road element is delimited by 2 nodes.
comment: Un elemento stradale è delimitato da due nodi. @it
label: Finisce al nodo @it

Ends at stop
type: ObjectProperty
domain: Route Section
range: Bus Stop
comment: A route section is delimited by two consecutive bus stops.
comment: Una sezione di tratta del TPL è delimitata da due fermate consecutive. @it
label: Finisce alla fermata @it

Finishes at junction
type: ObjectProperty
domain: RouteLink
range: Route Junction
comment: Ciascun tratto lineare di strada ha una giunzione iniziale e una giunzione finale. @it
comment: Each routeLink, has a beginning and an end junction.
label: Finisce alla giunzione @it

Forming administrative road
type: ObjectProperty
inverse of: Has road element
domain: Road element
range: Administrative Road
comment: More road elements form an administrative road.
comment: Più elementi stradali formano un'estesa amministrativa. @it
label: Forma una strada amministrativa @it

Forms table
type: ObjectProperty
domain: Traffic sensor
range: Sensor Site Table
comment: More road sensors form a sensor Table.
comment: Più sensori stradali formano una tabella di sensori. @it
label: Forma la tabella @it

Has avm record
type: ObjectProperty
inverse of: Refers to ride
domain: Ride
range: AVM Record
comment: La rilevazione AVM fa riferimento ad uno specifica corsa del TPL. @it
comment: The AVM refer to a specific ride code.
label: Ha avm record @it

Has acceess
type: ObjectProperty
domain: Class
  union of: Business Entity
  union of: Service
range: Entry
comment: Point corresponding to the house number of service.
comment: Punto corrispondente al numero civico del servizio. @it
label: Ha accesso @it

Has attribute
type: ObjectProperty
domain: Class
  union of: Actuator
  union of: Sensor
range: Device attribute
comment: Individua uno degli attributi del dispositivo (soggetto). @it
comment: It identifies one of the attributes of the device (subject).
label: Ha attributo @it

Has beacon observation
type: ObjectProperty
domain: Beacon
range: Beacon observation
comment: Connette ciascun lampione alle rilevazioni che produce. @it
comment: To connect each beacon to observations that it produces.
label: Ha osservazione di beacon @it

Has car park sensor
type: ObjectProperty
inverse of: Observe car park
domain: Transfer service and renting
range: Car Park Sensor
comment: Mette in relazione ciascun parcheggio con il sensore installato su di esso. @it
comment: To connect each car park to its installed sensor.
label: Ha il sesore di parcheggio @it

Has district
type: ObjectProperty
domain: Municipality Administration
range: District
comment: A municipality can be divided in districts.
comment: Un comune può essere suddiviso in frazioni o quartieri. @it
label: Ha il quartiere @it

Has element
type: ObjectProperty
inverse of: Is part of line
domain: Railway Line
range: Railway Element
comment: A railway line is composed by more railway element.
comment: Una linea ferroviaria è formata da più elementi ferroviari. @it
label: Ha elemento @it

Has expected time
type: ObjectProperty
inverse of: Instant forecast
domain: BusStop Forecast
range: Instant
comment: L'orario previsto di arrivo alla prossima fermata del TPL. @it
comment: The expected time at the next bus stops.
label: Ha tempo di attesa @it

Has external access
type: ObjectProperty
domain: Street Number
range: Entry
comment: Corrisponde ad una porta esterna dell'edificio. @it
comment: It corresponds to the outer gate of the building.
label: Ha accesso esterno @it

Has first element
type: ObjectProperty
domain: Maneuver
range: Road element
comment: Il primo elemento stradale interessato dalla manovra. @it
comment: The first element concerned by the maneuver.
label: Ha il primo elemento @it

Has first section
type: ObjectProperty
domain: Route
range: Route Section
comment: Defines which is the departure section of a route.
comment: Definisce qual è la sezione di partenza di una tratta del TPL. @it
label: Ha prima sezione @it

Has first stop
type: ObjectProperty
domain: Route
range: Bus Stop
comment: Defines which is the departure stop of a route.
comment: Definisce qual'è la stazione di partenza di una tratta del TPL. @it
label: Ha prima fermata @it

Has forecast
type: ObjectProperty
domain: Bus Stop
range: BusStop Forecast
comment: Ciascuna previsione si riferisce ad una specifica fermata del TPL. @it
comment: Each forecast refers to a specific bus stop.
label: Ha previsione @it

Has geometry
type: ObjectProperty
domain: Class
  union of: District
  union of: Railway Element
  union of: Route
  union of: Service
range: Geometry
comment: Alcuni servizi e tutti gli elementi ferroviari hanno una specifica geometria, sono ad esempio poligoni, o linee. @it
comment: Some services and all railway elements have a specific geometry like polygons or linestrings.
label: Ha geometry @it

Has internal access
type: ObjectProperty
domain: Street Number
range: Entry
comment: Corrisponde alla porta dell'edificio. @it
comment: It corresponds to the door of the building.
label: Ha accesso interno @it

Has last stop
type: ObjectProperty
domain: Route
range: Bus Stop
comment: Defines which is the last stop of a route.
comment: Individua l'ultima fermata di una tratta del TPL. @it
label: Ha ultima fermata @it

Has last stop time
type: ObjectProperty
inverse of: Instant avm
domain: AVM Record
range: Instant
comment: L'orario di arrivo all'ultima fermata. @it
comment: The arrival time at last bus stops.
label: Ha tempo di arrivo all'ultima fermata @it

Has maneuver
type: ObjectProperty
domain: Entry Rule
range: Maneuver
comment: An entry rule can be connected to a specific maneuver.
comment: Una regola di accesso può essere messa in relazione con una specifica manovra. @it
label: Ha la manovra @it

Has monitoring station
type: ObjectProperty
inverse of: Is part of ICQA agglomeration
domain: Air Quality Criticality Index agglomeration
range: Air quality monitoring station
comment: Mette in corrispondenza gli agglomerati ICQA con le stazioni di rilevamento che in essi si trovano. @it
comment: Relates an ICQA agglomeration to its monitoring stations.
label: Ha stazione di rilevamento @it

Has municipality
type: ObjectProperty
inverse of: Is part of province
domain: Provincial Administration
range: Municipality Administration
comment: A province is formed by more municipalities.
comment: Una provincia è formata da più comuni. @it
label: Ha il comune @it

Has observation
type: ObjectProperty
inverse of: Measured by sensor
domain: Class
  union of: Traffic sensor
  union of: Weather sensor
range: Observation
comment: Ciascun sensore stradale produce una rilevazione ogni 20 minuti. @it
comment: Each road sensor produce a report every 20 minutes.
label: Ha osservazione @it

Has prediction
type: ObjectProperty
domain: Weather Report
range: Weather prediction
comment: A report is made up of more predictions.
comment: Un bollettino è formato da più previsioni. @it
label: Ha previsione @it

Has province
type: ObjectProperty
inverse of: Is part of region
domain: Regional Administration
range: Provincial Administration
comment: In a region there are more than one province.
comment: In una regione ci sono più province. @it
label: Ha la provincia @it

Has record
type: ObjectProperty
inverse of: Related to sensor
domain: Car Park Sensor
range: Situation Record of a Car Park
comment: Every 10 minutes a sensor sends a report.
comment: Ogni dieci minuti, il sensore invia un aggiornamento. @it
label: Ha il record @it

Has regular service
type: ObjectProperty
domain: Transverse Service
range: Regular Service
comment: I servizi ordinari (principali) possono essere collegati con servizi trasversali (ausiliari). @it
comment: Regular services can be connected to transverse services.
label: Ha servizio regolare @it

Has resolution
type: ObjectProperty
domain: Public Administration
range: Resolution
comment: Collega una delibera all'ebte che la ha approvata. @it
comment: To connect a resolution to the municipality that have approved it.
label: Ha delibera @it

Has road element
type: ObjectProperty
domain: Administrative Road
range: Road element
comment: More road elements form an administrative road.
comment: Più elementi stradali formano un'estesa amministrativa. @it
label: Ha il road element @it

Has route
type: ObjectProperty
domain: Bus Line
range: Route
comment: Ciascuna tratta del TPL insiste su di una linea. @it
comment: Each route refers to a line.
label: Ha percorso @it

Has route link
type: ObjectProperty
domain: Route
range: RouteLink
comment: A route section is composed by more route link.
comment: Una sezione di una tratta del TPL è formata da più segmenti. @it
label: Ha il route link @it

Has rule
type: ObjectProperty
domain: Road element
range: Entry Rule
comment: Alcuni elementi stradali sono soggetti a restrizioni di accesso. @it
comment: Some road elements are subject to rules of access.
label: Ha regola @it

Has second element
type: ObjectProperty
domain: Maneuver
range: Road element
comment: Il secondo elemento interessato dalla manovra. @it
comment: The second element concerned the maneuver.
label: Ha il secondo elemento @it

Has section
type: ObjectProperty
domain: Route
range: Route Section
comment: Defines all the other section of a route.
comment: Individua tutte le sezioni di una tratta del TPL che non siano individuate attraverso altre più specifiche proprietà. @it
label: Ha sezione @it

Has segment
type: ObjectProperty
domain: Road element
range: RoadLink
comment: Ciascun elemento stradale può essere rivisto come una successione di tratti di strada lineari. @it
comment: Each road element can be see as a collection of consecutive road link.
label: Ha segmento @it

Has statistic
type: ObjectProperty
domain: Class
  union of: Public Administration
  union of: Road
range: StatisticalData
comment: Collega una statistica al comune cui la stessa si riferisce. @it
comment: To connect a statistic to the referred municipality.
label: Ha statistica @it

Has street number
type: ObjectProperty
domain: Road
range: Street Number
comment: Each road has street numbers.
comment: Ogni strada ha numeri civici. @it
label: Ha numero civico @it

Has third element
type: ObjectProperty
domain: Maneuver
range: Road element
comment: Il terzo elemento stradale interessato dalla manovra. @it
comment: The third element concerned the maneuver.
label: Ha il terzo elemento @it

Has transfer Service
type: ObjectProperty
domain: Train Station
range: Transfer service and renting
comment: Collega ciascuna stazione ferroviaria al servizio corrispondente. @it
comment: To connect each train station to the correspondant service.
label: Ha servizio di trasferimento @it

Has transverse service
type: ObjectProperty
domain: Regular Service
range: Transverse Service
comment: I servizi ordinari (principali) possono essere collegati a servizi trasversali (ausiliari). @it
comment: Regular services can be connected to transverse services.
label: Ha servizio trasversale @it

Has weather report
type: ObjectProperty
inverse of: Refers to municipality
domain: Municipality Administration
range: Weather Report
comment: Ciascuna previsione meteo è associata ad un comune. @it
comment: Each weather forecasts is connected to a municipality.
label: Ha report meteorologico @it

In hamlet of
type: ObjectProperty
domain: Class
  union of: Road
  union of: Road element
range: Hamlet
comment: Questa proprietà indica la frazione dove la strada o il segmento di strada si trova. @it
comment: This property indicates the hamlet where the road or the segment of road is located.
label: Nella frazione di @it

In municipality of
type: ObjectProperty
domain: Class
  union of: Hamlet
  union of: Road
range: Public Administration
comment: Collega ciascuna strada al comune in cui si trova. @it
comment: Municipality to which the road belongs.
label: Nel comune @it

Include forecast
type: ObjectProperty
domain: AVM Record
range: BusStop Forecast
comment: Ciascuna rilevazione AVM permette di formulare più predizioni. @it
comment: Each AVMrecord includes more forecasts.
label: Include previsione @it

Instant avm
type: ObjectProperty
domain: Instant
range: AVM Record
comment: Orario di arrivo all'ultima fermata. @it
comment: The arrival time at last bus stops.
label: Istante dell'avm @it

Instant Beacon Observ
type: ObjectProperty
inverse of: Measured date
domain: Instant
range: Beacon observation
comment: Data e ora di ciascuna rilevazione eseguita dal lampione. @it
comment: Time and date of each Beacon observation.
label: Istante di osservazione del beacon @it

Instant forecast
type: ObjectProperty
domain: Instant
range: BusStop Forecast
comment: L'orario di arrivo previsto alla fermata successiva. @it
comment: The expected time at the next bus stops.
label: Istante di previsione @it

Instant observation
type: ObjectProperty
inverse of: Measured time
domain: Instant
range: Observation
comment: Orario della rilevazione. @it
comment: The time of one observation.
label: Istante dell'osservazione @it

Instant parking
type: ObjectProperty
inverse of: Observation time
domain: Instant
range: Situation Record of a Car Park
comment: Orario di rilevazione della situazione del parcheggio. @it
comment: The generation time of one situation record.
label: Istante di parcheggio @it

Instant weather report
type: ObjectProperty
inverse of: Update time
domain: Instant
range: Weather Report
comment: Orario di generazione del bollettino meteo. @it
comment: The generation time of a new weather report.
label: Istante di previsione del tempo @it

Is composed by element
type: ObjectProperty
domain: Railway Section
range: Railway Element
comment: A railway section is composed by more railway element.
comment: Una sezione di ferrovia è formata da più elementi ferroviari. @it
label: E' composto da elemento @it

Is in element
type: ObjectProperty
domain: milestone mileage
range: Road element
comment: Ciascuna pietra miliare si trova su di un elemento stradale. @it
comment: Each milestone need to refers to a road element.
label: E' nell'elemento @it

Is in municipality
type: ObjectProperty
domain: Bus Stop
range: Public Administration
comment: A bus stop can be connected to the municipality to which belong.
comment: Una fermata del TPL può fare riferimento al comune in cui si trova. @it
label: E' nel comune @it

Is in region
type: ObjectProperty
equivalent property: Is part of region
comment: Questa proprietà indica la regione in cui il soggetto si trova. @it
comment: This property indicates the region where the subject is located.
label: E' nella regione @it

Is in road
type: ObjectProperty
domain: Class
  union of: Service
  union of: Train Station
range: Road
comment: La stazione ferroviaria ed il servizio ad essa associato possono essere messi in relazione con la strada su cui la stazione si affaccia. @it
comment: Service and train station can be connected to the referred Road.
label: E' nella strada @it

Is part of ICQA agglomeration
type: ObjectProperty
domain: Air quality monitoring station
range: Air Quality Criticality Index agglomeration
comment: La stazione di monitoraggio della qualità dell'aria è posta in relazione con l'agglomerato ICQA a cui appartiene. @it
comment: Relates each air quality monitoring station to the ICQA agglomerate where it is located.
label: E' parte di un agglomerato ICQA @it

Is part of line
type: ObjectProperty
domain: Railway Element
range: Railway Line
comment: A railway line is composed by more railway element.
comment: Una linea ferroviaria è formata da più elementi ferroviari. @it
label: E' parte della linea @it

Is part of lot
type: ObjectProperty
domain: Class
  union of: Bus Stop
  union of: Bus Line
range: TPL Lot
comment: Bus stops and bus lines are part of a lot.
comment: Linee e fermate del TPL appartengono ad un lotto definito a livello regionale. @it
label: E' parte del lotto @it

Is part of province
type: ObjectProperty
domain: Municipality Administration
range: Provincial Administration
comment: A province is formed by more municipalities.
comment: Una provincia è formata da più comuni. @it
label: E' parte della provincia @it

Is part of region
type: ObjectProperty
domain: Provincial Administration
range: Regional Administration
comment: In a region there are more than one province.
comment: In una regione c'è più di una provincia. @it
label: E' parte della regione @it

Is part of Road
type: ObjectProperty
domain: Road element
range: Road
comment: More road elements compose a road.
comment: Più elementi stradali formano una strada. @it
label: E' parte della strada @it

Lanes
type: ObjectProperty
domain: Class
  union of: Road
  union of: Road element
range: Lanes
comment: Questa proprietà referenzia la rappresentazione dell'insieme delle corsie che sono tracciate su di una strada o su di un elemento stradale. @it
comment: This property indicates the set of the lanes that are drawed on the asphalt of the road or segment of road.
label: Corsie @it

Lanes count
type: ObjectProperty
domain: Lanes
range: Lanes count
comment: La proprietà referenzia la rappresentazione della conta delle corsie, fornita separatamente per le corsie riservate a particolariutilizzi e per quelle disponibili per tutte le tipologie di veicoli. @it
comment: The property indicates the representation of the count of the lanes, provided separately for the designated lanes and for the lanes available for all of the vehicles.
label: Conta delle corsie @it

Lanes details
type: ObjectProperty
domain: Lanes
range: Seq
comment: La proprietà indica le particolari restrizioni che si applicano a una o più delle corsie. @it
comment: This property indicates the specific restrictions that apply to one or more of the lanes.
label: Dettagli corsie @it

Last stop
type: ObjectProperty
domain: AVM Record
range: Bus Stop
comment: Ciascuna rilevazione AVM comprende l'indicazione dell'ultima fermata fatta prima della rilevazione stessa. @it
comment: The AVMrecord specify which is the last bus stop made.
label: Ultiima fermata @it

Managing authority
type: ObjectProperty
domain: Road element
range: Public Administration
comment: Riferimento all'ente che ha in carico il tratto di strada. @it
comment: The authority that deals with the road elements management.
label: Autorita' gestionale @it

Measured by beacon
type: ObjectProperty
domain: Beacon observation
range: Beacon
comment: Mette in relazione la rilevazione con il lampione che l'ha eseguita. @it
comment: To connect each observation to the beacon that has produced it.
label: Misurato dal beacon @it

Measured by sensor
type: ObjectProperty
domain: Observation
range: Traffic sensor
range: Weather sensor
comment: Each observation refers to only one road sensor.
comment: Mette in relazione la rilevazione con il sensore stradale che l'ha eseguita. @it
label: Misurato dal sensore @it

Measured date
type: ObjectProperty
domain: Beacon observation
range: Instant
comment: Data e ora in cui è stata eseguita la rilevazione da parte del lampione. @it
comment: Time and date of each Beacon observation.
label: Data misurata @it

Measured time
type: ObjectProperty
domain: Observation
range: Instant
comment: La data e ora in cui è stata eseguita la rilevazione. @it
comment: The time of one observation.
label: Tempo misurato @it

Near to
type: ObjectProperty
domain: Entry
range: Node
comment: Questa proprietà indica il nodo del grafo stradale che si trova più vicino all'accesso. @it
comment: This property indicates the node of the street graph that is the nearest to the entry.
label: Vicino a @it

Node
type: ObjectProperty
domain: Turn restriction
range: Node
comment: La proprietà indica dove si incrociano i segmenti della strada a cui si applica la restrizione. @it
comment: The property indicates where the segments of road cross to which the restriction applies.
label: Nodo @it

Observation time
type: ObjectProperty
domain: Situation Record of a Car Park
range: Instant
comment: Orario in cui è stata eseguita la rilevazione della situazione del parcheggio. @it
comment: The generation time of one situation record.
label: Tempo di osservazione @it

Observe car park
type: ObjectProperty
domain: Car Park Sensor
range: Transfer service and renting
comment: Mette in relazione ciascun sensore con il parcheggio in cui lo stesso si trova. @it
comment: To connect each sensor to the referred car park service.
label: Osserva il parcheggio @it

On route
type: ObjectProperty
domain: Class
  union of: AVM Record
  union of: Ride
range: Route
comment: Corse e rilevazioni AVM fanno riferimento ad una specifica tratta del TPL. @it
comment: Rides and AVMrecords refer to a specific route.
label: Sul percorso @it

Owner authority
type: ObjectProperty
domain: Administrative Road
range: Public Administration
comment: Riferimento all'ente proprietario della strada. @it
comment: The authority that owns the administrative road.
label: Autorità proprietaria @it

Placed in element
type: ObjectProperty
domain: Entry
range: Road element
comment: Ciascun accesso ad un edificio, contiene il riferimento al tratto di strada su cui lo stesso si trova. @it
comment: Each entry need to refers to a road.
label: Posizionato nell'elemento @it

Placed on road
type: ObjectProperty
domain: Traffic sensor
range: Road
comment: Mette in relazione ciascun sensore stradale con la strada su cui lo stesso si trova. @it
comment: To connect each road sensor to the road in which is installed.
label: Posizionato nella strada @it

Refers to municipality
type: ObjectProperty
domain: Weather Report
range: Municipality Administration
comment: Fa riferimento al comune a cui la previsione meteo si riferisce. @it
comment: Specifies the municipality for the weather forecast.
label: Si riferisce al comune @it

Refers to ride
type: ObjectProperty
domain: AVM Record
range: Ride
comment: La rilevazione AVM fa riferimento alla corsa del TPL durante la quale la rilevazione è stata eseguita. @it
comment: The AVM refer to a specific ride code.
label: Si riferisce alla corsa @it

Refers to road element
type: ObjectProperty
range: Road element
comment: Refers to road element
comment: Si riferisce ad un elemento stradale @it
label: Si riferisce ad un elemento stradale @it

Related to sensor
type: ObjectProperty
domain: Situation Record of a Car Park
range: Car Park Sensor
comment: Fa riferimento al parcheggio in cui la situazione indicata è stata rilevata. @it
comment: Refers to the parking where the situation record was produced.
label: Relativo al sensore @it

Restrictions
type: ObjectProperty
domain: Lane
range: Bag
comment: La proprietà indica l'elenco delle restrizioni che si applicano alla corsia. @it
comment: The property indicates the set of restrictions that apply to the lane.
label: Restrizioni @it

Scheduled on line
type: ObjectProperty
domain: Ride
range: Bus Line
comment: A ride can be scheduled on a single line.
comment: Una corsa del TPL insiste su di una linea. @it
label: Programmato sulla linea @it

Start at junction
type: ObjectProperty
domain: Railway Element
range: Railway Junction
comment: A railway element is delimited by two junctions.
comment: Un elemento ferroviario è delimitato da due giunzioni. @it
label: Inizia alla giunzione @it

Starting junction
type: ObjectProperty
domain: RoadLink
range: Junction
comment: A road link is delimited by two junctions.
comment: Un segmento lineare di strada è delimitato da due giunzioni. @it
label: Giunzione di partenza @it

Starts at node
type: ObjectProperty
domain: Road element
range: Node
comment: A road element is delimited by 2 nodes.
comment: Un elemento stradale è delimitato da due nodi. @it
label: Inizia al nodo @it

Start at stop
type: ObjectProperty
domain: Route Section
range: Bus Stop
comment: A route section is delimited by two consecutive bus stops.
comment: Una sezione di tratta del TPL è delimitata da due fermate consecutive. @it
label: Inizia alla fermata @it

Toward
type: ObjectProperty
domain: Turn restriction
range: Road element
comment: La proprietà indica la strada verso cui la svolta è obbligatoria o proibita. @it
comment: The property indicates the road toward which the turn is mandatory or forbidden.
label: Destinazione @it

Update time
type: ObjectProperty
domain: Weather Report
range: Instant
comment: Orario di produzione del bollettino meteo. @it
comment: The generation time of a new weather report.
label: Tempo di aggiornamento @it

Semantic label
type: ObjectProperty
domain: Device attribute
range: Property
comment: Il tipo di misurazione che l'attributo rappresenta. @it
comment: The type of measurement represented by the attribute.
label: Etichetta semantica @it

Waste type
type: ObjectProperty
domain: Class
  union of: Smart waste container observation
  union of: Waste container
range: Waste container type
comment: Fa riferimento ad una tipologia di contenitore per i rifiuti (plastica, carta, vetro, e così via). @it
comment: Specify the waste type (plastics, paper, glass, and the like).
label: Tipo di contenitore @it

Where
type: ObjectProperty
domain: Class
  union of: Access restriction
  union of: Lane
  union of: Lanes
  union of: Limitations
  union of: Turn restriction
range: Class
  union of: Lane
  union of: Lanes
  union of: Node
  union of: Road element
  union of: Road
comment: La proprietà inquadra il soggetto all'interno del proprio contesto di riferimento. @it
comment: This property frames the subject within its context of reference.
label: Dove @it

containsFlow
type: ObjectProperty
comment: A relation between a Production Line and the Flow located in such space.

endIn
type: ObjectProperty
comment: The Physical Object into which the Flow end.

Is part of industrial area
type: ObjectProperty
domain: Site
range: IndustrialArea
comment: An industrial site is part of an industrial area.
comment: Un sito industriale è parte di un'area industriale. @it
label: E' parte di un'area industriale @it

startIn
type: ObjectProperty
comment: The Physical Object from which the Flow start.

Type
type: ObjectProperty
domain: Resource
range: Class
comment: Il soggetto è istanza di una classe. @it
comment: The subject is an instance of a class.
label: Tipo @it

Based near
type: ObjectProperty
domain: Bus Stop
range: Node
comment: La proprietà indica il nodo del grafo stradale che si trova più vicino alla fermata dell'autobus. @it
comment: This property indicates the node of the street graph that is the nearest to the bus stop.
label: Posizionato vicino a @it

Alternative name
type: DatatypeProperty
domain: Class
  union of: Municipality Administration
  union of: Provincial Administration
  union of: Regional Administration
  union of: Road
range: string
comment: La proprietà indica una denominazione alternativa per il soggetto. @it
comment: This property indicates an alternative name for the subject.
label: Denominazione alternativa @it

Identifier
type: DatatypeProperty
domain: Class
  union of: Entry
  union of: milestone mileage
  union of: Municipality Administration
  union of: Node
  union of: Provincial Administration
  union of: Regional Administration
  union of: Road element
  union of: Street Number
  union of: Road
range: string
comment: La proprietà fornisce un identificativo univoco per il soggetto. @it
comment: The property provides a unique identifier for the subject.
label: Identificativo @it

ATV
type: DatatypeProperty
domain: Lanes count
range: integer
comment: La proprietà indica il numero delle corsie riservate ai veicoli di larghezza inferiore a 1,27 m. @it
comment: The property indicates the number of the lanes that are designated for the vehicles having width lower than 1,27 metres.

Abbreviation
type: DatatypeProperty
domain: Service
range: string
comment: Abbreviation of the description of the service.
comment: Abbreviazione della descrizione del servizio @it
label: Abbreviazione @it

Access
type: DatatypeProperty
domain: Access restriction
range: string
comment: Questa proprietà specifica la tipologia di restrizione. @it
comment: This property indicates the type of restriction.
label: Accesso @it

Access type
type: DatatypeProperty
range: string
comment: Informa su come sono recuperati i dati (chiamate HTTP, Rest, ecc.) @it
comment: It provides an information about the data retrieval method (HTTP, Rest, etc.)
label: Tipo di accesso @it

Administrative Road Name
type: DatatypeProperty
domain: Administrative Road
range: string
comment: Denominazione ufficiale della strada @it
comment: Official name of the road
label: Nome di strada amministrativa @it

address village
type: DatatypeProperty
comment: Aiuta a localizzare il servizio, specificando ad esempio il palazzo storico entro cui è ospitato, il quartiere, o altro. @it
comment: It helps locate the service, specifying, for example, the historic building where it is located, the neighborhood, or something else.
label: Quartiere @it

Admin class
type: DatatypeProperty
domain: Administrative Road
range: string
comment: Administrative classification of the road
comment: Classificazione amministrativa della strada @it
label: Classe amministrativa @it

Agency Phone
type: DatatypeProperty
comment: Il campo agency_phone contiene un numero di telefono a singola voce per l'agenzia specificata. Questo campo è un valore stringa che presenta il numero di telefono come tipico per l'area di servizio dell'agenzia. Può e deve contenere segni di punteggiatura per raggruppare le cifre del numero. Il testo dialabile (ad esempio, "503-238-RIDE" di TriMet) è consentito, ma il campo non deve contenere nessun altro testo descrittivo. @it
comment: The agency_phone field contains a single voice telephone number for the specified agency. This field is a string value that presents the telephone number as typical for the agency's service area. It can and should contain punctuation marks to group the digits of the number. Dialable text (for example, TriMet's "503-238-RIDE") is permitted, but the field must not contain any other descriptive text.
label: Numero telefonico dell'agenzia @it

Agricoltural
type: DatatypeProperty
domain: Lanes count
range: integer
comment: La proprietà indica il numero delle corsie riservate ai mezzi agricoli. @it
comment: The property indicates the number of the lanes that are designated for the agricoltural vehicles.
label: Mezzi agricoli @it

Air quality
type: DatatypeProperty
comment: Fornisce una misura del livello di inquinamento dell'aria @it
comment: It provides a measurement of the level of air pollution
label: Qualità dell'aria @it

Air quality - Benzene
type: DatatypeProperty
sub property of: Air quality
comment: Concentrazione media giornaliera di Benzene espressa in microgrammi per metro cubo. @it
comment: Daily average concentration of Benzene expressed in micrograms per cubic meter.
label: Qualità dell'aria - Benzene @it

Air quality - CO
type: DatatypeProperty
sub property of: Air quality
comment: Massimo valor medio mobile calcolato su finestre di 8 ore della concentrazione di CO espressa in milligrammi per metro cubo. @it
comment: Maximum mobile average over 8h of CO concentration expressed in milligrams per cubic meter
label: Qualità dell'aria - CO @it

Air quality - Combined
type: DatatypeProperty
sub property of: Air quality
comment: Fornisce una misura d'insieme della qualità dell'aria, combinando opportamente diversi indicatori. @it
comment: It provides an overall measure of air quality, combining different indicators appropriately.
label: Qualità dell'aria - Valore riepilogativo @it

Air quality - H2S
type: DatatypeProperty
sub property of: Air quality
comment: Concentrazione massima oraria di H2S espressa in microgrammi per metro cubo. @it
comment: Maximum hourly concentration of H2S expressed in micrograms per cubic meter
label: Qualità dell'aria - H2S @it

Air quality - ICQA
type: DatatypeProperty
sub property of: Air quality
comment: Fornisce il valore dell'indice ICQA definito dalla Regione Toscana per la misurazione della qualità dell'aria a livello di agglomerato urbano @it
comment: It provides the value of the ICQA index defined by the Tuscany Region for the measurement of air quality at urban agglomeration level
label: Qualità dell'aria - ICQA @it

Air quality - NO2
type: DatatypeProperty
sub property of: Air quality
comment: Concentrazione massima oraria di NO2 espressa in microgrammi per metro cubo. @it
comment: Maximum hourly concentration of NO2 expressed in micrograms per cubic meter
label: Qualità dell'aria - NO2 @it

Air quality - O3
type: DatatypeProperty
sub property of: Air quality
comment: Massima concentrazione oraria di O3 espressa in microgrammi per metro cubo. @it
comment: Maximum hourly concentration of O3 expressed in micrograms per cubic meter
label: Qualità dell'aria - O3 @it

Air quality - PM10
type: DatatypeProperty
sub property of: Air quality
comment: Concentrazione media giornaliera di PM10 espressa in microgrammi per metro cubo. @it
comment: Daily average concentration of PM10 expressed in micrograms per cubic meter
label: Qualità dell'aria - PM10 @it

Air quality - PM2.5
type: DatatypeProperty
sub property of: Air quality
comment: Concentrazione media giornaliera di PM2.5 espressa in microgrammi per metro cubo. @it
comment: Daily average concentration of PM2.5 expressed in micrograms per cubic meter.
label: Qualità dell'aria - PM2.5 @it

Air quality - SO2
type: DatatypeProperty
sub property of: Air quality
comment: Concentrazione massima oraria di SO2 espressa in microgrammi per metro cubo. @it
comment: Maximum hourly concentration of SO2 expressed in micrograms per cubic meter
label: Qualità dell'aria - SO2 @it

Alert area
type: DatatypeProperty
sub property of: topDataProperty
comment: It identifies ​​the alert area in the context of water hazard prevention
comment: Riporta la sigla dell'area di allerta definita nel contesto della prevenzione del rischio idrico @it
label: Area di allerta @it

Allowed armed forces access
type: DatatypeProperty
range: boolean
comment: Indica se è attiva una restrizione di accesso che tuttavia permette il transito alle forze armate. @it
comment: It indicates whether an access restriction is active but allows transit to the armed forces.
label: Accesso permesso forze armate @it

Allowed authorized veihicles access
type: DatatypeProperty
range: boolean
comment: Indica se è attiva una restrizione di accesso che tuttavia permette il transito ai veicoli autorizzati. @it
comment: It indicates whether an access restriction is active but still permits transit to authorized vehicles.
label: Permesso accesso a veicoli autorizzati @it

Allowed bicycle access
type: DatatypeProperty
range: boolean
comment: Indica se è attiva una restrizione di accesso che tuttavia permette il transito alle biciclette. @it
comment: It indicates whether an access restriction is active but still permits the transit of bicycles.
label: Permesso accesso con bicicletta @it

Allowed disabled access
type: DatatypeProperty
range: boolean
comment: Indica se è attiva una restrizione di accesso che tuttavia permette il transito ai disabili. @it
comment: It indicates whether an access restriction is active but still allows for the disabled.
label: Permesso accesso ai disabili @it

Allowed access to driver included rented car
type: DatatypeProperty
range: boolean
comment: Indica se è attiva una restrizione di accesso che tuttavia permette il transito alle vetture noleggiate con conducente. @it
comment: It indicates whether an access restriction is active but still permits transit to cars rented with a driver.
label: Accesso consentito a Noleggio Con Conducente @it

Allowed electric bicycle access
type: DatatypeProperty
range: boolean
comment: Indica se è attiva una restrizione di accesso che tuttavia permette il transito alle biciclette elettriche. @it
comment: It indicates whether an access restriction is active but allows transit to electric bicycles.
label: Permesso accesso con bicicletta elettrica @it

Allowed extraurban bus access
type: DatatypeProperty
range: boolean
comment: Indica se è attiva una restrizione di accesso che tuttavia permette il transito agli autobus extra-urbani. @it
comment: It indicates whether an access restriction is active but allows transit to non-urban buses.
label: Permesso accesso ai bus extraurbani @it

Allowed only emergency access
type: DatatypeProperty
comment: Indica se è attiva una restrizione di accesso che tuttavia permette il transito ai mezzi di soccorso. @it
comment: It indicates whether an access restriction is active but allows transit to rescue vehicles.
label: Permesso accesso solo per emergenza @it

Allowed operating vehicles access
type: DatatypeProperty
range: boolean
comment: Indica se è attiva una restrizione di accesso che tuttavia permette il transito ai mezzi impegnati nei lavori. @it
comment: It indicates whether an access restriction is active, however it allows transit to the means involved in the work.
label: Permesso accesso a mezzi operativi @it

Allowed police and emergency access
type: DatatypeProperty
range: boolean
comment: Indica se è attiva una restrizione di accesso che tuttavia permette il transito alla polizia e ai mezzi di soccorso. @it
comment: It indicates whether an access restriction is active but allows transit to the police and rescue vehicles.
label: Permesso accesso a mezzi di polizia e soccorso @it

Allowed urban bus access
type: DatatypeProperty
range: boolean
comment: Indica se è attiva una restrizione di accesso che tuttavia permette il transito agli autobus urbani. @it
comment: It indicates whether an access restriction is active but still allows for urban bus transit.
label: Permesso accesso bus urbani @it

Alter code
type: DatatypeProperty
domain: Road
range: string
comment: Indica un codice alternativo per la strada. @it
comment: It indicates an alternative code for the road.
label: Codice alternativo @it

Alternative e-mail
type: DatatypeProperty
comment: Indica un indirizzo e-mail secondario. @it
comment: It indicates a secondary e-mail address.
label: E-mail alternativa @it

Alternative fax
type: DatatypeProperty
comment: Indica un numero di fax secondario. @it
comment: It indicates a secondary fax number.
label: Fax alternativo @it

Alternative phone
type: DatatypeProperty
comment: Indica un numero di telefono secondario. @it
comment: It indicates a secondary phone number.
label: Telefono alternativo @it

Altitude
type: DatatypeProperty
sub property of: topDataProperty
comment: Indica l'altitudine a cui si trova la stazione meteo che ha eseguito la rilevazione. @it
comment: It indicates the altitude to which the weather station is located.
label: Altitudine @it

AMQP Queue
type: DatatypeProperty
domain: AMQP Broker
range: string
comment: It represents a message queue within a broker that implements the AMQP protocol.
comment: Rappresenta una coda di messaggi in un broker che implementa il protocollo AMQP. @it
label: Coda AMQP @it

Air quality - PM10 Exceedance
type: DatatypeProperty
sub property of: Air quality
comment: Fornisce il conteggio del numero degli sforamenti della soglia di PM10 nell'ultimo anno. @it
comment: It provides the count of the number of PM10 threshold strides in the last year.
label: Qualità dell'aria - Sforamenti PM10 @it

Area code
type: DatatypeProperty
domain: Service
range: string
comment: Area code, defined at the municipal level, where the service or sensor is located.
comment: Codice dell'area, definita a livello comunale, all'interno della quale si trova localizzato il servizio o il sensore che ha eseguito una rilevazione. @it
label: Codice area @it

Area name
type: DatatypeProperty
domain: Service
range: string
comment: Name of the area, defined at the municipal level, where the service or the sensor is located.
comment: Nome dell'area, definita a livello comunale, all'interno della quale si trova localizzato il servizio o il sensore che ha eseguito una rilevazione. @it
label: Nome area @it

Ateco code
type: DatatypeProperty
domain: Service
range: string
comment: It provides the ATECO classification code for the service.
comment: Riporta il codice di classificazione ATECO del servizio. @it
label: Codice ateco @it

Attributes status
type: DatatypeProperty
domain: Class
  union of: Actuator
  union of: Sensor
range: string
comment: Mappati o non mappati. @it
comment: Whether thay are mapped or not.
label: Stato degli attributi @it

Automaticity
type: DatatypeProperty
range: string
comment: It specifies whether data capture can be executed in a totally automated way or if an operator is needed.
comment: Specifica se l'acquisizione dati possa essere eseguita in modo totalmente automatico o necessiti dell'intervento di un operatore. @it
label: Automaticità @it

Average distance
type: DatatypeProperty
domain: Traffic observation
range: string
comment: Average distance between two vehicles passing one from one to the other.
comment: Distanza media tra due veicoli che transitano l'uno di seguito all'altro. @it
label: Distanza media @it

Average speed
type: DatatypeProperty
domain: Traffic observation
range: string
comment: Average speed at which vehicles pass.
comment: Velocità media a cui transitano i veicoli. @it
label: Velocità media @it

Average time
type: DatatypeProperty
domain: Traffic observation
range: string
comment: Average time between 2 transits
comment: Tempo medio tra 2 transiti @it
label: Tempo medio @it

Axial mass
type: DatatypeProperty
domain: Railway Section
range: string
comment: It provides a railway line classification code based on the maximum allowed axial mass
comment: Riporta un codice di classificazione della linea ferroviaria sulla base della massa assiale massima che devono avere i treni che transitano sulla linea. @it
label: Massa assiale @it

Battery level
type: DatatypeProperty
comment: Indica il livello delle batterie, in un contenitore per i rifiuti dotato di funzionalità avanzate. @it
comment: It indicates the level of the batteries, in a waste container with advanced features.
label: Livello batterie @it

Bicycle
type: DatatypeProperty
domain: Lanes count
range: integer
comment: La proprietà indica il numero delle corsie riservate alle biciclette. @it
comment: The property indicates the number of the lanes that are designated for the bicycles.
label: Bicicletta @it

Code blue count
type: DatatypeProperty
domain: First Aid state
range: integer
comment: Fornisce un'indicazione del numero di pazienti in codice rosso presenti nella struttura di Pronto Soccorso al momento della rilevazione. La proprietà si chiama codice blu, riprendendo la classificazione in uso in alcuni Paesi anglofoni. @it
comment: It provides an indication of the number of red code patients present in the First Aid facility when detecting. The property is called blue code, resuming the classification used in some English-speaking countries.
label: Codice rosso @it

Botanical family
type: DatatypeProperty
comment: Botanical family
comment: Famiglia botanica @it
label: Famiglia botanica @it

Bus
type: DatatypeProperty
domain: Lanes count
range: integer
comment: La proprietà indica il numero delle corsie riservate agli autobus. @it
comment: The property indicates the number of the lanes that are designated for the buses.
label: Autobus @it

Capacity
type: DatatypeProperty
domain: Class
  union of: Car Park Sensor
  union of: Waste container
range: string
comment: La capienza del parcheggio, o del contenitore per i rifiuti. @it
comment: The capacity of the parking lot, or the garbage container.
label: Capacità @it

Car park status
type: DatatypeProperty
domain: Situation Record of a Car Park
range: string
comment: Descrive lo stato del parcheggio, indicando se ci sono posti liberi, se è pieno, o se non sono disponibili informazioni sulla presenza di posti liberi. @it
comment: It describes the status of the parking lot, indicating whether there are any vacancies, if it is full, or if there is no information on the presence of vacant posts.
label: Stato del parcheggio @it

Caravan
type: DatatypeProperty
domain: Lanes count
range: integer
comment: La proprietà indica il numero delle corsie riservate ai caravan. @it
comment: The property indicates the number of the lanes that are designated for the caravan.

Category
type: DatatypeProperty
domain: Train Station
range: string
comment: It provides the railway station category, an overall indicator of the quality of the railway line.
comment: Riporta la categoria della stazione ferroviaria, un indicatore complessivo della qualità dello scalo ferroviario. @it
label: Categoria @it

Class code
type: DatatypeProperty
domain: Street Number
range: string
comment: It indicates the color of the civic number, for those cities where there are two independent numbering systems, the red numbers and the black numbers.
comment: Riporta il colore del numero civico, per quelle città in cui esistono due numerazioni indipendenti, i civici rossi e i civici neri. @it
label: Codice della classe @it

Collection time
type: DatatypeProperty
domain: Waste container
comment: Orario in cui viene eseguito lo svuotamento del contenitore per i rifiuti. @it
comment: The time when the waste container is emptied.
label: Orario dello svuotamento @it

Combined traffic
type: DatatypeProperty
domain: Railway Section
range: string
comment: It provides a technical information related to the railroad.
comment: Riporta un dato tecnico relativo alla tratta ferroviaria. @it
label: Traffico combinato @it

Composition
type: DatatypeProperty
domain: Road element
range: string
comment: Indica se il tratto di strada è a carreggiata unica oppure a carreggiate separate. @it
comment: It indicates whether the stretch of road is on a single road or on separate roadways.
label: Composizione @it

Concentration
type: DatatypeProperty
domain: Traffic observation
range: string
comment: It provides the concentration of vehicles detected by the traffic sensor.
comment: Riporta la concentrazione di veicoli rilevata dal sensore di traffico. @it
label: Concentrazione @it

Condition
type: DatatypeProperty
domain: Class
  union of: Access restriction
  union of: Limitations
range: string
comment: La proprietà indica le condizioni sotto le quali la restrizione si applica. @it
comment: This property specifies the conditions under which the restriction applies.
label: Condizione @it

Creation datetime
type: DatatypeProperty
domain: Class
  union of: Actuator
  union of: Message Broker
  union of: Sensor
range: dateTime
comment: La data e ora in cui il dispositivo o il broker è stato creato. @it
comment: The date and time when the subject has been created.
label: Data e ora di creazione @it

Current water level
type: DatatypeProperty
sub property of: Water level
comment: It indicates the last detected water level.
comment: Riporta l'ultimo livello delle acque registrato. @it
label: Livello delle acque attuale @it

Current wind direction
type: DatatypeProperty
sub property of: Wind direction
comment: It provides the last detected wind direction.
comment: Riporta la direzione del vento così come è stata individuata nell'ultima rilevazione compiuta. @it
label: Direzione del vento attuale @it

Current wind gust speed
type: DatatypeProperty
sub property of: Wind gust speed
comment: Riporta il più recente tra i valori di velocità gust del vento rilevati. @it
comment: Windness detected by equally fractionating the time, and returning the peak of the last fraction.
label: Ultima velocità gust del vento @it

Currently active
type: DatatypeProperty
range: boolean
comment: Attualmente attiva @it
comment: Currently active
label: Attualmente attiva @it

Air quality - O3 exceedance count
type: DatatypeProperty
sub property of: Air quality
comment: Number of times in the day that O3 concentracion is over 180mg/m3
comment: Numero di volte nell'arco delle 24 ore in cui la concentrazione di O3 ha superato 180 mg/m3. @it
label: Qualità dell'aria - Numero sforamenti O3 @it

Air quality - O3 exceedance duration
type: DatatypeProperty
sub property of: Air quality
comment: Hours in the day that O3 concentracion is over 180mg/m3
comment: Numero di ore nell'arco delle 24 ore in cui la concentrazione è stata superiore a 180mg/m3 @it
label: Qualità dell'aria - Durata sforamenti O3 @it

Data type
type: DatatypeProperty
domain: Device attribute
range: string
comment: Il tipo di dato delle misurazioni che l'attributo rappresenta. @it
comment: The data type of the detections that the attribute represents.
label: Tipo di dato @it

Day
type: DatatypeProperty
domain: Weather prediction
range: string
comment: Day to which the weather forecast refers.
comment: Giorno a cui si riferisce la previsione meteo. @it
label: Giorno @it

Day off
type: DatatypeProperty
domain: Turn restriction
range: string
comment: Questa proprietà indica il giorno in cui la restrizione termina. @it
comment: This property indicates the day when the restriction ends.
label: Giorno di terminazione @it

Start restriction
type: DatatypeProperty
domain: Turn restriction
range: string
comment: Questa proprietà indica il giorno in cui la restrizione inizia. @it
comment: This property indicates the day when the restriction starts.
label: Inizio restrizione @it

Depth
type: DatatypeProperty
comment: Depth in kilometers
comment: Profondità espressa in chilometri @it
label: Profondità @it

Different values
type: DatatypeProperty
domain: Device attribute
range: integer
comment: Nel caso in cui lo stato di salute del dispositivo sia rilevato verificando che le osservazioni non restituiscano tutte quante lo stesso risultato, questa proprietà indica quante delle più recenti osservazioni devono essere prese in considerazione per eseguire questo tipo di valutazione. @it
comment: When the healthy of the device is evalutated checking that it does not always produce the same value in output, this property indicates how many of the most recent observations must be taken into consideration for executing the evaluation.
label: Valori distinti @it

Direction
type: DatatypeProperty
domain: Class
  union of: Access restriction
  union of: Lanes
  union of: Limitations
  union of: Route
range: string
comment: Direction of the route.
comment: Direzione del percorso. @it
label: Direzione @it

Disabled
type: DatatypeProperty
domain: Device attribute
range: boolean
comment: Indica se l'attributo deve essere o meno mostrato all'utente, indicizzato, e quant'altro. @it
comment: It indicates whether the attribute should be displayed to users, indexed, and so on.
label: Disabilitato @it

Distance
type: DatatypeProperty
domain: Route Section
range: string
comment: Distance between two stops within the route.
comment: Distanza tra due fermate successive all'interno del percorso. @it
label: Distanza @it

District code
type: DatatypeProperty
domain: Service
range: string
comment: Code of the neighborhood where the service is located.
comment: Codice del quartiere in cui il servizio si trova localizzato. @it
label: Codice quartiere @it

Element location
type: DatatypeProperty
domain: Class
  union of: Railway Element
  union of: Road element
range: string
comment: It provides a categorization of the road or rail segment, indicating whether it is on a bridge, rather than inside a tunnel or other.
comment: Riporta una categorizzazione relativa al segmento di strada o di linea ferroviaria, indicando se si trovi su di un ponte, piuttosto che all'interno di un tunnel o altro. @it
label: Locazione dell'elemento @it

Element class
type: DatatypeProperty
domain: Road element
range: string
comment: It provides an indication of the importance of the road to which the road segment belongs (motorway, street, urban road and so on)
comment: Riporta un'indicazione circa l'importanza della strada a cui il tratto di strada appartiene (autostrada, strada extraurbana, strada urbana e così via) @it
label: Classe dell'elemento @it

Element type
type: DatatypeProperty
domain: Class
  union of: Railway Element
  union of: Road element
range: string
comment: It provides a categorization of the road or rail segment, for example, for a road segment, it says if it is located at a crossroad, on a roundabout, on a square, on a parking lot, and so on.
comment: Riporta una categorizzazione del segmento di strada o di linea ferroviaria, ad esempio per i segmenti di strada, indica se si trova su di un incrocio, su di una rotatoria, su di una piazza, su di un parcheggio, e così via. @it
label: Tipo di elemento @it

Emergency
type: DatatypeProperty
domain: Lanes count
range: integer
comment: La proprietà indica il numero delle corsie riservate ai servizi di emergenza. @it
comment: The property indicates the number of the lanes that are designated for the emergency vehicles.
label: Emergenza @it

Enrolled students
type: DatatypeProperty
domain: School Observation
comment: Il numero di studenti iscritti. @it
comment: The number of enrolled students.
label: Studenti iscritti @it

Entry type
type: DatatypeProperty
domain: Entry
range: string
comment: Indica se si tratti di un varco interno, piuttosto che di un varco esterno che affaccia sulla pubblica via, o altro. @it
comment: It indicates whether it is an interior pass, rather than an outside outcrop overlooking the public road, or something else.
label: Tipo di accesso @it

estimatedYearsToReturn
type: DatatypeProperty
sub property of: topDataProperty
comment: estimatedYearsToReturn

estimatedYearsToReturn12Hours
type: DatatypeProperty
sub property of: estimatedYearsToReturn
comment: estimatedYearsToReturn12Hours

estimatedYearsToReturn1Hour
type: DatatypeProperty
sub property of: estimatedYearsToReturn
comment: estimatedYearsToReturn1Hour

estimatedYearsToReturn24Hours
type: DatatypeProperty
sub property of: estimatedYearsToReturn
comment: estimatedYearsToReturn24Hours

estimatedYearsToReturn3Hours
type: DatatypeProperty
sub property of: estimatedYearsToReturn
comment: estimatedYearsToReturn3Hours

estimatedYearsToReturn6Hours
type: DatatypeProperty
sub property of: estimatedYearsToReturn
comment: estimatedYearsToReturn6Hours

Event category
type: DatatypeProperty
domain: Event
range: string
comment: It provides the type of event, whether it is a theatrical work, a festival, an extraordinary opening, a sporting event, and so on.
comment: Riporta la tipologia di evento, se si tratta cioè di un'opera teatrale, di un festival, di un'apertura straordinaria, di un evento sportivo, e così via. @it
label: Categoria di evento @it

Event time
type: DatatypeProperty
domain: Event
range: string
comment: It shows the start time of the event.
comment: Riporta l'orario di inizio dell'evento. @it
label: Orario evento @it

Except
type: DatatypeProperty
domain: Turn restriction
range: string
comment: La proprietà indica le categorie di veicoli a cui la restrizione non si applica. @it
comment: The property indicates the categories of vehicle to which the restriction does not apply.
label: Eccezioni @it

Exit rate
type: DatatypeProperty
domain: Situation Record of a Car Park
range: string
comment: It provides the vehicle exit rate from the parking lot, ie the number of outgoing vehicles per hour.
comment: Riporta il tasso di uscita dei veicoli dal parcheggio, cioè il numero di veicoli in uscita per ogni ora. @it
label: Tasso di uscita @it

Expected time
type: DatatypeProperty
domain: BusStop Forecast
range: string
comment: Orario in cui è previsto l'arrivo del bus alla fermata. DA ELIMINARE QUANDO INSTANT FUNZIONERA' ALLA PERFEZIONE. @it
comment: Timetable for bus arrival at the stop. TO DELETE WHEN INSTANT FUNCTIONS TO PERFECT.
label: Tempo di attesa @it

Exponent
type: DatatypeProperty
domain: Street Number
range: string
comment: It provides the literal part of the civic number, if present.
comment: Riporta la parte letterale del numero civico, se presente. @it
label: Esponente @it

Extend name
type: DatatypeProperty
domain: Road
range: string
comment: It provides the full name of the road, including generic naming.
comment: Riporta il nome completo della strada, comprensivo di denominazione urbanistica generica. @it
label: Nome esteso @it

Extend number
type: DatatypeProperty
domain: Street Number
range: string
comment: It provides the civic number for extended, including both the numerical part and the literal number where it is present.
comment: Riporta il numero civico per esteso, comprensivo quindi sia della parte numerica, che di quella letterale ove presente. @it
label: Numero esteso @it

Fill rate
type: DatatypeProperty
domain: Situation Record of a Car Park
range: string
comment: It provides the parking rate, as the number of inbound vehicles per hour.
comment: Riporta il tasso di riempimento del parcheggio, inteso come il numero dei veicoli in ingresso per ogni ora. @it
label: Tasso di riempimento @it

Firenze card
type: DatatypeProperty
domain: Service
range: string
comment: Indica se il servizio è erogato a condizioni agevolate ai possessori di Firenze Card. @it
comment: It provides whether the service is provided on favorable terms to holders of Firenze Card.

State of First Aid
type: DatatypeProperty
domain: First Aid state
range: string
comment: Indica se il numero di persone in attesa indicato si riferisca al totale delle persone che si trovano in Pronto Soccorso, oppure soltanto a quelle che si trovano in una certa condizione (in visita, in attesa, in osservazione, e così via). @it
comment: It indicates whether the counts refer to the total number of people standing in the First Aid with that specific code, or only to those who are at a specific stage (visiting, pending, observing, and so on).
label: Stato del Pronto Soccorso @it

Flow rate
type: DatatypeProperty
sub property of: topDataProperty
comment: Sliding rate
comment: Tasso di scorrimento @it
label: Tasso di scorrimento @it

Forestry
type: DatatypeProperty
domain: Lanes count
range: integer
comment: La proprietà indica il numero delle corsie riservate ai mezzi forestali. @it
comment: The property indicates the number of the lanes that are designated for the forestry vehicles.
label: Mezzi forestali @it

Format
type: DatatypeProperty
domain: Class
  union of: Actuator
  union of: Sensor
range: string
comment: Il formato in cui sono rappresentati i dati prodotti dal dispositivo. @it
comment: The format in which the data produced by the device is represented.
label: Formato @it

Free
type: DatatypeProperty
domain: Situation Record of a Car Park
range: string
comment: It provides the number of free places in the parking lot.
comment: Riporta il numero dei posti liberi nel parcheggio. @it
label: Libero @it

Free event
type: DatatypeProperty
domain: Event
range: string
comment: Indica se l'evento è gratuito o a pagamento. @it
comment: It indicates whether the event is free or paid.
label: Evento gratuito @it

freephone
type: DatatypeProperty
comment: It provides the green number to dial to get in touch with the service call center.
comment: Riporta il numero verde da comporre per mettersi in contatto con il call center del servizio. @it
label: numero verde @it

Gauge
type: DatatypeProperty
domain: Railway Element
range: string
comment: It provides the type of gauge, which can be reduced or standard. It's a technical information relating to the railroad.
comment: Riporta il tipo di scartamento, che può essere ridotto o standard, un'informazione tecnica relativa alla tratta ferroviaria. @it
label: Scarto @it

Geographic area type
type: DatatypeProperty
comment: Indica se il sensore si trova collocato in un'area rurale, urbana o suburbana. @it
comment: The geographic area type where the sensor is (eg. urban, suburban).
label: Tipo di area geografica @it

Goods
type: DatatypeProperty
domain: Lanes count
range: integer
comment: La proprietà indica il numero delle corsie riservate ai veicoli commerciali. @it
comment: The property indicates the number of the lanes that are designated for the lightweight vehicles trasporting goods.
label: Veicoli commerciali @it

Green code count
type: DatatypeProperty
domain: First Aid state
range: integer
comment: It provides the number of patients who are admitted to Green Emergency Rescue.
comment: Riporta il numero di pazienti che si trovano ricoverati in Pronto Soccorso in codice verde. @it
label: Pazienti in codice verde @it

Time Point
type: DatatypeProperty
comment: Il campo del punto di tempo può essere utilizzato per indicare gli orari di arrivo e partenza per il veicolo di transito o se sono invece tempi approssimativi e / o interpolati. Il campo consente a GTFS di fornire tempi di stop interpolati che potenzialmente incorporano conoscenze locali, ma indicano comunque se i tempi sono approssimativi. Per le voci di stop-time con orari di arrivo e partenza specificati, i valori validi per questo campo sono: * vuoto - I tempi sono considerati esatti. * 0 - I tempi sono considerati approssimativi. * 1 - I tempi sono considerati esatti. Per le voci di stop-time senza orari di arrivo e partenza specificati, i consumatori di feed devono intercettare gli orari di arrivo e partenza. I produttori di mangimi possono facoltativamente indicare che tale voce non è un punto di tempo (valore = 0) ma è un errore contrassegnare una voce come un tempo (valore = 1) senza specificare gli orari di arrivo e partenza. @it
comment: The timepoint field can be used to indicate if the specified arrival and departure times for a stop are strictly adhered to by the transit vehicle or if they are instead approximate and/or interpolated times. The field allows a GTFS producer to provide interpolated stop times that potentially incorporate local knowledge, but still indicate if the times are approximate. For stop-time entries with specified arrival and departure times, valid values for this field are: * empty - Times are considered exact. * 0 - Times are considered approximate. * 1 - Times are considered exact. For stop-time entries without specified arrival and departure times, feed consumers must interpolate arrival and departure times. Feed producers may optionally indicate that such an entry is not a timepoint (value=0) but it is an error to mark a entry as a timepoint (value=1) without specifying arrival and departure times.
comment: Time Point @it

Hazmat
type: DatatypeProperty
domain: Lanes count
range: integer
comment: La proprietà indica il numero delle corsie riservate al trasporto di materiali pericolosi. @it
comment: The property indicates the number of the lanes that are designated for the transport of hazardous materials.
label: Trasporti pericolosi @it

Healthiness criteria
type: DatatypeProperty
domain: Device attribute
range: string
comment: Indica in che modo sia possibile determinare se il dispositivo sia o meno in salute. @it
comment: It indicates what way it is possible to determine whether the device is in good health or not.
label: Criterio di salubrità @it

Height hour
type: DatatypeProperty
domain: Weather Report
range: string
comment: It provides the time when the sun is expected to reach its maximum height.
comment: Riporta l'orario in cui si prevede che il sole raggiungerà la sua massima altezza. @it
label: Ora maggiore altezza @it

Heavy goods vehicles
type: DatatypeProperty
domain: Lanes count
range: integer
comment: La proprietà indica il numero delle corsie riservate ai mezzi pesanti. @it
comment: The property indicates the number of the lanes that are designated for the heavy goods vehicles.
label: Mezzi pesanti @it

Highway type
type: DatatypeProperty
domain: Road element
range: string
comment: La proprietà indica il tipo di strada. @it
comment: The property indicates the type of road.
label: Tipo di strada @it

Horse
type: DatatypeProperty
domain: Lanes count
range: integer
comment: La proprietà indica il numero delle corsie riservate al transito a cavallo. @it
comment: The property indicates the number of the lanes that are designated for the transit with horses.
label: Cavalli @it

Hour
type: DatatypeProperty
domain: Weather prediction
range: string
comment: Indica l'orario a cui la previsione meteo si riferisce. @it
comment: It provides the time the weather forecast refers to.
label: Ora @it

Air quality - Maximum O3 exceedance
type: DatatypeProperty
sub property of: Air quality
comment: Hour in the day that O3 concentracion is at maximum
comment: Ora del giorno in cui la concentrazione di O3 è stata al massimo. @it
label: Qualità dell'aria - Massimo sforamento O3 @it

Hour off
type: DatatypeProperty
domain: Turn restriction
range: string
comment: La proprietà indica l'orario di termine della restrizione. @it
comment: The property indicates the time when the restriction ends.
label: Orario di fine @it

Hour on
type: DatatypeProperty
domain: Turn restriction
range: string
comment: La proprietà indica l'orario in cui la restrizione inizia. @it
comment: The property indicates the time when the restriction starts.
label: Orario di inizio @it

House number
type: DatatypeProperty
domain: Class
  union of: Event
  union of: Service
range: string
comment: It provides the civic number where the service is located or where the event takes place.
comment: Riporta il numero civico in cui si trova localizzato il servizio, o in cui si svolge l'evento. @it
label: Numero civico @it

Humidity
type: DatatypeProperty
sub property of: topDataProperty
domain: Weather prediction
range: string
comment: Percentage of humidity.
comment: Percentuale di umidità. @it
label: Umidità @it

Agglomeration
type: DatatypeProperty
domain: Air quality monitoring station
comment: Indica l'agglomerato in cui la stazione di rilevamento degli inquinanti si trova collocata. @it
comment: The agglomeration where the monitoring station is
label: Agglomerato @it

Internal temperature
type: DatatypeProperty
comment: Internal temperature
comment: Temperatura interna @it
label: Temperatura interna @it

is a self-service
type: DatatypeProperty
domain: Service
range: boolean
comment: Indica se il servizio è una stazione di rifornimento carburanti self-service. @it
comment: It indicates whether the service is a refueling station self-service.
label: è un self-service @it

Junction type
type: DatatypeProperty
domain: Railway Junction
range: string
comment: Indica il tipo di giunzione ferroviaria, ad esempio se si tratti di un passaggio a livello, di una terminazione di binario, di uno scalo merci, e così via. @it
comment: It indicates the type of railway junction, for example whether it is a level crossing, a track termination, a freight train, and so on.
label: Tipo di giunzione @it

Last observation humidity
type: DatatypeProperty
sub property of: Humidity
comment: Indica l'ultimo valore di umidità rilevato dalla stazione meteo. @it
comment: it indicates the last humidity value detected by the weather station.
label: Ultima umidità rilevata @it

Last stop time
type: DatatypeProperty
domain: AVM Record
range: string
comment: Orario in cui il bus ha raggiunto l'ultima fermata. DA ELIMINARE QUANDO INSTANT FUNZIONERA' ALLA PERFEZIONE. @it
comment: The time the bus has reached the last stop. TO BE DELETED WHEN INSTANT FUNCTIONS TO PERFECT.
label: Orario ultima fermata @it

Last triples
type: DatatypeProperty
range: string
comment: It indicates the last date when the RDF triples have been updated.
comment: Riporta l'ultima data in cui sono state aggiornate le triple RDF. @it
label: Ultime triple @it

Last update
type: DatatypeProperty
range: string
comment: It indicates the last date when the source data has been updated.
comment: Riporta l'ultima data in cui i dati sorgenti hanno subito un aggiornamento. @it
label: Ultimo aggiornamento @it

Leaf wetness
type: DatatypeProperty
comment: Humidity value detected by intelligent sprinkler.
comment: Valore di umidità rilevato dall'irrigatore intelligente. @it
label: Umidità della foglia @it

Length
type: DatatypeProperty
domain: Class
  union of: Railway Element
  union of: Road element
range: string
comment: It provides the length of the road segment (road element) or rail line.
comment: Riporta la lunghezza del segmento di strada (elemento stradale) o di linea ferroviaria. @it
label: Lunghezza @it

Limit
type: DatatypeProperty
domain: Limitations
range: string
comment: La proprietà indica il valore limite imposto dalla restrizione. @it
comment: The property provides the limit value imposed by the restriction.
label: Limite @it

Line number
type: DatatypeProperty
domain: Service
range: string
comment: Indica il numero della linea a cui la fermata appartiene. @it
comment: it indicates the number of the line to which the stop belongs. @it
label: Numero linea @it

Lunar phase
type: DatatypeProperty
domain: Weather Report
range: string
comment: Fase lunare. @it
comment: Monn phase.
label: Fase lunare @it

MAC address
type: DatatypeProperty
domain: Class
  union of: Actuator
  union of: Sensor
range: string
comment: L'indirizzo MAC del dispositivo. @it
comment: The MAC address of the device.
label: Indirizzo MAC @it

Magnitude type
type: DatatypeProperty
comment: Indica il tipo di magnitudo dell'evento sismico. @it
comment: It indicates the type of magnitude of the earthquake event.
label: Tipo di magnitudo @it

Magnitude value
type: DatatypeProperty
comment: Indica il valore di magnitudo dell'evento sismico. @it
comment: It indicates the magnitude of the earthquake event.
label: Magnitudo @it

Major
type: DatatypeProperty
domain: Beacon
range: string
comment: Il major, in un dispositivo Beacon, è un numero intero positivo che concorre, assieme al minor e all'UUID, ad individuare univocamente il dispositivo. @it
comment: The major, in a Beacon device, is a positive integer that, together with the minor and the UUID, uniquely identifies the device.

Managing authority
type: DatatypeProperty
domain: Train Station
range: string
comment: Individua l'ente o la società responsabile della gestione dello scalo ferroviario. @it
comment: It identifies the administration or the company responsible for managing the railway station.
label: Autorità che gestisce @it

Managing by
type: DatatypeProperty
domain: Class
  union of: AVM Record
  union of: Traffic sensor
  union of: Service
range: string
comment: AVM system or road sensors operator.
comment: Ente gestore del sistema AVM o dei sensori stradali. @it
label: Gestito da @it

Maneuver type
type: DatatypeProperty
domain: Maneuver
range: string
comment: Descrive il tipo di restrizione (biforcazione, manovra proibita, manovra obbligatoria). @it
comment: It describes the type of restriction (bifurcation, forbidden maneuver, mandatory maneuver).
label: Tipo di manovra @it

Max temperature
type: DatatypeProperty
domain: Weather prediction
range: string
comment: It provides the maximum expected temperature.
comment: Riporta la temperatura massima prevista. @it
label: Temperatura massima @it

Min temperature
type: DatatypeProperty
domain: Weather prediction
range: string
comment: It provides the minimum expected temperature.
comment: Riporta la temperatura minima prevista. @it
label: Temperatura minima @it

Minor
type: DatatypeProperty
domain: Beacon
range: string
comment: Il minor, in un dispositivo Beacon, è un numero intero positivo che concorre, assieme al major e all'UUID, ad individuare univocamente il dispositivo. @it
comment: The minor, in a Beacon device, is a positive integer that, together with the major and the UUID, uniquely identifies the device.

Model
type: DatatypeProperty
domain: Class
  union of: Actuator
  union of: Sensor
range: string
comment: Il modello di dispositivo. @it
comment: The model of the device.
label: Modello @it

Mofa
type: DatatypeProperty
domain: Lanes count
range: integer
comment: La proprietà indica il numero delle corsie riservate ai ciclomotori con velocità ridotta. @it
comment: The property indicates the number of the lanes that are designated for the mofas.
label: Ciclomotori a velocità ridotta @it

Monitoring station type
type: DatatypeProperty
comment: Indica il tipo della stazione di monitoraggio della qualità dell'aria (fondo, traffico, industriale). @it
comment: Type of montioring station (e.g. fondo, traffico, industriale)
label: Tipologia di stazione @it

Moonrise
type: DatatypeProperty
domain: Weather Report
range: string
comment: Indica l'ora prevista per il sorgere della luna. @it
comment: It provides the expected time for the moon to rise.
label: Luna sorge @it

Moonset
type: DatatypeProperty
domain: Weather Report
range: string
comment: In indicates the expected time for the moon to set.
comment: Indica l'orario previsto per il tramonto della luna. @it
label: Luna tramonta @it

Moped
type: DatatypeProperty
domain: Lanes count
range: integer
comment: La proprietà indica il numero delle corsie riservate ai ciclomotori. @it
comment: The property indicates the number of the lanes that are designated for the mopeds.
label: Ciclomotori @it

Motor vehicle
type: DatatypeProperty
domain: Lanes count
range: integer
comment: La proprietà indica il numero delle corsie riservate ai veicoli a motore. @it
comment: The property indicates the number of the lanes that are designated for the motor vehicles.
label: Veicoli a motore @it

Motorcar
type: DatatypeProperty
domain: Lanes count
range: integer
comment: La proprietà indica il numero delle corsie riservate alle automobili. @it
comment: The property indicates the number of the lanes that are designated for the motorcars.
label: Automobili @it

Motorcycle
type: DatatypeProperty
domain: Lanes count
range: integer
comment: La proprietà indica il numero delle corsie riservate ai motocicli. @it
comment: The property indicates the number of the lanes that are designated for the motorcycles.
label: Motocicli @it

MQTT Topic
type: DatatypeProperty
domain: MQTT Broker
range: string
comment: A topic in a broker that implements the MQTT protocol. @it
comment: Un topic in un broker che implementa il protocollo MQTT. @it
label: Topic MQTT @it

Multimedia resource
type: DatatypeProperty
domain: Service
range: string
comment: It provides the Internet address of a media resource related to the service.
comment: Riporta l'indirizzo Internet di una risorsa multimediale relativa al servizio. @it
label: Risorsa multimediale @it

Node type
type: DatatypeProperty
domain: Node
range: string
comment: It provides the node's category (intersection, toll, roundabout, roadway terminal, and so on).
comment: Riporta la categoria di appartenenza del nodo (intersezione, casello, rotatoria, terminale di elemento stradale, e così via). @it
label: Tipo del nodo @it

Track number
type: DatatypeProperty
domain: Railway Element
range: string
comment: Numero di binari presenti. Valorizzata a zero in caso di tratto ferroviario in costruzione o dismesso. @it
comment: The number of available tracks. Set to zero in the case of a railway section under construction or discarded.
label: Numero binario @it

Number
type: DatatypeProperty
domain: Street Number
range: string
comment: It provides the numerical part of the civic number.
comment: Riporta la parte numerica del numero civico. @it
label: Numero @it

Occupancy
type: DatatypeProperty
domain: Observation
range: string
comment: It provides the occupancy rate of the road detected by the traffic sensor.
comment: Riporta la percentuale di occupazione della strada rilevata dal sensore del traffico. @it
label: Occupazione @it

Occupied
type: DatatypeProperty
domain: Situation Record of a Car Park
range: string
comment: Number of occupied parking spaces.
comment: Numero di posti occupati. @it
label: Occupato @it

Operating status
type: DatatypeProperty
domain: Class
  union of: Railway Element
  union of: Road element
range: string
comment: Indica se l'elemento stradale o il tratto di ferrovia è in costruzione, in esercizio, o è stato dismesso. @it
comment: It indicates whether the road element or railroad section is under construction, in operation, or has been discarded.
label: Stato operativo @it

Order (Position)
type: DatatypeProperty
domain: Device attribute
range: integer
comment: La posizione dell'attributo all'interno dell'insieme degli attributi del dispositivo. @it
comment: The position of the attribute within the set of attributes of the device.
label: Numero d'ordine (Posizione) @it

Other house number
type: DatatypeProperty
comment: It provides a second civic number to which the service can be accessed.
comment: Riporta un secondo numero civico a cui è possibile trovare lo stesso servizio. @it
label: Altro numero civico @it

Other street address
type: DatatypeProperty
comment: It provides a second street address to which the service can be accessed.
comment: Riporta un secondo indirizzo a cui è possibile trovare lo stesso servizio. @it
label: Altro indirizzo stradale @it

Overtime
type: DatatypeProperty
range: string
comment: Indica dopo quanto tempo il processo di importazione deve essere forzatamente interrotto. @it
comment: It indicates the maximum execution time of the import process, after which it is killed.

Owner
type: DatatypeProperty
domain: Beacon
domain: Class
  union of: AVM Record
  union of: Service
range: string
comment: AVM system owner.
comment: Ente proprietario del sistema AVM. @it
label: Proprietario @it

Park occupancy
type: DatatypeProperty
domain: Situation Record of a Car Park
range: string
comment: Percentage of occupied parking spaces.
comment: Percentuale di posti occupati. @it
label: Occupazione del parcheggio @it

Parking spaces for disabled
type: DatatypeProperty
domain: Car Park Sensor
comment: Indica il numero di posti disponibili riservati ai disabili. @it
comment: It indicates the number of parking places reserved to disabled people.
label: Posti per disabili @it

Parking spaces for scooters
type: DatatypeProperty
domain: Car Park Sensor
comment: Indica il numero dei posti disponibili riservati ai mezzi a due ruote. @it
comment: It indicates the number of parking places reserved for scooters and similar.
label: Posti per scooter @it

Password
type: DatatypeProperty
domain: Message Broker
range: string
comment: La password che dovrebbe essere utilizzata per accedere al broker. @it
comment: The password that should be used for accessing the broker.

Paying parking spaces
type: DatatypeProperty
domain: Car Park Sensor
comment: It indicates the number of available paid places.
comment: Riporta il numero dei posti a pagamento disponibili. @it
label: Posti a pagamento @it

Perc. temperature
type: DatatypeProperty
domain: Weather prediction
range: string
comment: Indica la temperatura percepita prevista. @it
comment: Indicates the expected perceived temperature.
label: Temperatura percepita @it

Container shape
type: DatatypeProperty
range: string
comment: Indica la forma del contenitore di rifiuti dotato di funzionalià avanzate. @it
comment: It indicates the shape of the waste bin with advanced features.
label: Forma del contenitore @it

Place
type: DatatypeProperty
domain: Street Number
range: string
comment: Località, per i numeri civici che non hanno una strada su OSM. @it
comment: Where the street number is located, for those cases where a place is specified in OSM instead of a street
label: Località @it

Place name
type: DatatypeProperty
domain: Event
range: string
comment: It indicates the name of the place where the event takes place.
comment: Riporta la denominazione del luogo in cui si svolge l'evento. @it
label: Nome del luogo @it

Pollen
type: DatatypeProperty
comment: Concentrazione di polline. @it
comment: Pollen concentration
label: Polline @it

Pollen concentration level
type: DatatypeProperty
sub property of: topDataProperty
comment: Livello di concentrazione di polline @it
comment: Pollen concentration level
label: Livello polline @it

Pollen concentration trend
type: DatatypeProperty
comment: Andamento della concentrazione di polline. @it
comment: Pollen concentration trend.
label: Trend polline @it

Porte cochere
type: DatatypeProperty
domain: Entry
range: string
comment: Indica la presenza di un passo carrabile. @it
comment: It indicates if the entry is a porte cochere.
label: Passo carrabile @it

Position
type: DatatypeProperty
domain: Lane
range: integer
comment: La proprietà indica la posizione della corsia, dalla sinistra della direzione di percorrenza. @it
comment: The property indicates the position of the lane, from the left of the driving direction.
label: Posizione @it

Power
type: DatatypeProperty
domain: Beacon
range: string
comment: Indica la potenza del lampione. @it
comment: Indicates the power of the lamppost.
label: Potenza @it

Primary type
type: DatatypeProperty
domain: Service
range: string
comment: Descrive il servizio principale che viene reso. @it
comment: It describes the main service that is provided.
label: Tipo primario @it

Process type
type: DatatypeProperty
range: string
comment: Descrive il tipo di processo. @it
comment: It describes the type of process.
label: Tipo di processo @it

Producer
type: DatatypeProperty
domain: Class
  union of: Actuator
  union of: Sensor
range: string
comment: L'azienda produttrice del dispositivo. @it
comment: The company that produces the device.
label: Produttore @it

Properties status
type: DatatypeProperty
domain: Class
  union of: Actuator
  union of: Sensor
range: string
comment: Mappate o non mappate. @it
comment: Whether they are mapped or not.
label: Stato delle proprietà @it

Protocol
type: DatatypeProperty
domain: Class
  union of: Actuator
  union of: Sensor
range: string
comment: Il protocollo di comunicazione con il broker. @it
comment: The protocol for communicating with the broker.
label: Protocollo @it

Public Service Vehicles
type: DatatypeProperty
domain: Lanes count
range: integer
comment: La proprietà indica il numero delle corsie riservate al trasporto pubblico locale. @it
comment: The property indicates the number of the lanes that are designated for the Public Service Vehicles.
label: Trasporto Pubblico Locale @it

Public
type: DatatypeProperty
domain: Beacon
range: string
comment: Indica se si tratta di un lampione dell'illuminazione pubblica. @it
comment: It indicates whether it is a public lighting streetlight.
label: Pubblico @it

Rail department
type: DatatypeProperty
domain: Goods Yard
range: string
comment: Indica il dipartimento ferroviario di cui lo scalo ferroviario fa parte. @it
comment: It indicates the railway department of which the railway line is part.
label: Dipartimento ferroviario @it

Railway siding
type: DatatypeProperty
domain: Goods Yard
range: string
comment: It provides the number of sidings available in the goods yard. @it
label: Numero di raccordi @it

Rainfall
type: DatatypeProperty
sub property of: topDataProperty
comment: Rainfall Detection
comment: Rilevazioni inerenti le precipitazioni @it
label: Pioggia @it

Rainfall last 12 hours
type: DatatypeProperty
sub property of: Rainfall
comment: Rainfall detection within the last 12 hours.
comment: Rilevazione della pioggia caduta nelle ultime 12 ore. @it
label: Pioggia 12h @it

Rainfall last 15 minutes
type: DatatypeProperty
sub property of: Rainfall
comment: Rainfall detection within the last 15 minutes.
comment: Rilevazione della pioggia caduta negli ultimi 15 minuti. @it
label: Pioggia 15min @it

Rainfall last 1 hour
type: DatatypeProperty
sub property of: Rainfall
comment: Rainfall detection within the last hour.
comment: Rilevazione della pioggia caduta nell'ultima ora. @it
label: Pioggia 1h @it

Rainfall last 24 hours
type: DatatypeProperty
sub property of: Rainfall
comment: Rainfall detection within the last 24 hours.
comment: Rilevazione della pioggia caduta nelle ultime 24 ore. @it
label: Pioggia 24h @it

Rainfall last 36 hours
type: DatatypeProperty
sub property of: Rainfall
comment: Rainfall detection within the last 36 hours.
comment: Rilevazione della pioggia caduta nelle ultime 36 ore. @it
label: Pioggia 36h @it

Rainfall last 3 hours
type: DatatypeProperty
sub property of: Rainfall
comment: Rainfall detection within the last 3 hours.
comment: Rilevazione della pioggia caduta nelle ultime 3 ore. @it
label: Pioggia 3h @it

Rainfall last 6 hours
type: DatatypeProperty
sub property of: Rainfall
comment: Rainfall detection within the last 6 hours.
comment: Rilevazione della pioggia caduta nelle ultime 6 ore. @it
label: Pioggia 6h @it

Rec temp
type: DatatypeProperty
domain: Weather prediction
range: string
comment: It returns the temperature actually detected.
comment: Riporta la temperatura effettivamente rilevata. @it
label: Temperatura registrata @it

Charging station status
type: DatatypeProperty
domain: Charging stations
range: string
comment: Describes the status of the column for charging electric vehicles.
comment: Descrive lo stato della colonnina per la ricarica dei veicoli elettrici. @it
label: Stato colonnina ricarica @it

Red code count
type: DatatypeProperty
domain: First Aid state
range: integer
comment: It provides the number of patients who are admitted to Red Emergency Assistance.
comment: Riporta la conta dei pazienti che sono ricoverati in Pronto Soccorso in codice rosso. @it
label: Pazienti in codice rosso @it

Reference person
type: DatatypeProperty
comment: Reference person
comment: Referente @it
label: Referente @it

Restriction
type: DatatypeProperty
sub property of: Restriction value
domain: Class
  union of: Entry Rule
  union of: Turn restriction
range: string
comment: La proprietà descrive il tipo di restrizione. @it
comment: The property describes the type of restriction.
label: Restrizione @it

Restriction type
type: DatatypeProperty
domain: Entry Rule
range: string
comment: Descrive la tipologia di restrizione attiva. @it
comment: It describes the type of the active restriction.
label: Tipo di restrizione @it

Restriction value
type: DatatypeProperty
domain: Entry Rule
range: string
comment: It provides a quantification for the active restriction, when applicable.
comment: Riporta la quantificazione della restrizione attiva, quando applicabile. @it
label: Valore della restrizione @it

Ride state
type: DatatypeProperty
domain: AVM Record
range: string
comment: State of the ride: advance, late, on time.
comment: Stato della corsa: anticipo, ritardo, in orario. @it
label: Stato corsa @it

River name
type: DatatypeProperty
sub property of: topDataProperty
comment: Nome del fiume @it
comment: River name
label: Nome del fiume @it

Road name
type: DatatypeProperty
domain: Road
range: string
comment: It indicates the name of the road without the generic naming.
comment: Riporta la denominazione della strada omettendo la denominazione urbanistica generica. @it
label: Nome di strada @it

Road type
type: DatatypeProperty
domain: Road
range: string
comment: It indicates the generic naming only.
comment: Riporta la denominazione urbanistica generica della strada. @it
label: Tipo di strada @it

Route
type: DatatypeProperty
domain: Road element
comment: La proprietà descrive il tracciato del segmento di strada. @it
comment: The property describe the route of the segment of road.
label: Tracciato @it

Route code
type: DatatypeProperty
domain: Service
range: string
comment: It provides the code of the thematic path.
comment: Riporta il codice del percorso tematico che viene offerto come servizio. @it
label: Codice percorso @it

Route length
type: DatatypeProperty
domain: Class
  union of: Route
  union of: Service
range: string
comment: It provides the route length.
comment: Riporta la lunghezza della tratta del TPL. @it
label: Lunghezza percorso @it

Route position
type: DatatypeProperty
domain: Service
range: string
comment: Indica la posizione del servizio all'interno di un percorso temartico. @it
comment: It provides the position of the service within the thematic path.
label: Posizione del percorso @it

Severity code
type: DatatypeProperty
comment: It provides a code that describes the severity of the event, used for mobility events.
comment: Riporta un codice che descrive la gravità dell'evento, utilizzato per gli eventi relativi alla mobilità. @it
label: Gravità @it

Short description
type: DatatypeProperty
comment: Brief indication of where the service is provided.
comment: Descrizione breve della posizione del servizio o evento @it
label: Descrizione breve @it

Snow
type: DatatypeProperty
domain: Weather prediction
range: string
comment: It provides a forecast about the snowfalls.
comment: Riporta la previsione relativa alla neve. @it
label: Neve @it

Soil water potential
type: DatatypeProperty
comment: It provides the soil water potential detected by the intelligent sprinkler.
comment: Riporta il potenziale dell'acqua al suolo rilevato dall'irrigatore intelligente. @it
label: Potenziale dell'acqua al suolo @it

Speed limit
type: DatatypeProperty
domain: Road element
range: string
comment: It indicates the speed limit in force on the specific road section.
comment: Specifica il limite di velocità in vigore sullo specifico tratto di strada (elemento stradale). @it
label: Limite di velocità @it

Speed percentile
type: DatatypeProperty
domain: Observation
range: string
comment: Percentile calcolato sulle velocità rilevate dal sensore di traffico. @it
comment: Percentile calculated on the speeds detected by the traffic sensor.
label: Velocità percentile @it

State
type: DatatypeProperty
domain: Class
  union of: Charging stations
  union of: Goods Yard
  union of: Train Station
range: string
comment: Describes the status of a charging station for electric vehicles, or a railway station.
comment: Descrive lo stato di una stazione di ricarica dei veicoli elettrici, o di una stazione ferroviaria. @it
label: Stato @it

STOMP Destination
type: DatatypeProperty
domain: STOMP Broker
range: string
comment: A destination in a broker that implements the STOMP protocol.
comment: Una destinazione in un broker che implementa il protocollo STOMP. @it
label: Destinazione STOMP @it

Stop number
type: DatatypeProperty
domain: Service
range: string
comment: It indicates the number of the TPL stop.
comment: Riporta il numero della fermata del TPL. @it
label: Numero fermata @it

Street with curb
type: DatatypeProperty
range: boolean
comment: Indica se in corrispondenza della linea di mezzeria sia presente un cordolo separatore dei due sensi di marcia. @it
comment: It indicates if the middle line is replaced by a separation wall.
label: Strada con cordolo separatore @it

Street with Restricted Traffic Zone access
type: DatatypeProperty
range: boolean
comment: Indica se la strada appartenga o meno ad una zona a traffico limitato. @it
comment: Indicates whether or not the street belongs to a restricted traffic zone.
label: Strada con porta telematica @it

Students at refectory
type: DatatypeProperty
domain: School Observation
comment: Il numero degli studenti iscritti al servizio mensa. @it
comment: The number of the students that are registered for the refectory service.
label: Studenti a mensa @it

Students at school
type: DatatypeProperty
domain: School Observation
comment: Il numero degli studenti presenti a scuola. @it
comment: The number of the students that are present at school.
label: Studenti a scuola @it

Sun height
type: DatatypeProperty
domain: Weather Report
range: string
comment: Indica l'altezza massima che raggiungerà il sole nel corso della giornata. @it
comment: Indicates the maximum height that will reach the sun during the day.
label: Altezza sole @it

Sunrise
type: DatatypeProperty
domain: Weather Report
range: string
comment: Indica l'ora a cui sorgerà il sole. @it
comment: Indicates the time at which the sun will rise.
label: Alba @it

Sunset
type: DatatypeProperty
domain: Weather Report
range: string
comment: Indica l'ora a cui tramonterà il sole. @it
comment: Indicates the time at which the sun will set.
label: Tramonto @it

Supply
type: DatatypeProperty
domain: Railway Element
range: string
comment: Indica se si tratti di una linea elettrificata o meno. @it
comment: Indicates whether it is an electrified line or not.
label: Alimentazione @it

Surface area
type: DatatypeProperty
range: float
comment: Dimensione della superficie @it
comment: Surface area
label: Dimensione della superficie @it

Taxi
type: DatatypeProperty
domain: Lanes count
range: integer
comment: La proprietà indica il numero delle corsie riservate ai taxi. @it
comment: The property indicates the number of the lanes that are designated for the taxis.

Temperature
type: DatatypeProperty
sub property of: topDataProperty
comment: Rilevazioni della temperatura. @it
comment: Temperature detection.
label: Temperatura @it

Temperature last observation
type: DatatypeProperty
sub property of: Temperature
comment: Indica il più recente valore di temperatura rilevato. @it
comment: It indicates the latest detected temperature value.
label: Temperatura ultima rilevazione @it

Today max temperature
type: DatatypeProperty
sub property of: Temperature
comment: Indica il valore massimo di temperatura rilevato nel corso della giornata. @it
comment: It indicates the maximum temperature value detected during the day.
label: Temperatura massima @it

Yesterday max temperature
type: DatatypeProperty
sub property of: Temperature
comment: Indica il valore massimo di temperatura registrato nella giornata precedente. @it
comment: It indicates the maximum temperature value recorded on the previous day.
label: Temperatura massima giornata precedente @it

Today min temperature
type: DatatypeProperty
sub property of: Temperature
comment: Indica il valore minimo di temperatura rilevato nel corso della giornata. @it
comment: It indicates the minimum temperature value detected during the day.
label: Temperatura minima @it

Yesterday min temperature
type: DatatypeProperty
sub property of: Temperature
comment: Indica il valore minimo di temperatura registrato nella giornata precedente. @it
comment: It indicates the minimum temperature value recorded on the previous day.
label: Temperatura minima giornata precedente @it

Text
type: DatatypeProperty
domain: milestone mileage
range: string
comment: Returns the text written on the milestone (mileage).
comment: Riporta il testo scritto sulla pietra miliare (l'indicazione chilometrica). @it
label: Testo @it

Threshold perc
type: DatatypeProperty
domain: Observation
range: string
comment: Threshold value for the percentile of the speeds detected by the traffic sensor.
comment: Valore di soglia del percentile calcolato sulle velocità di transito rilevate dal sensore di traffico. @it
label: Soglia del percentile @it

Time
type: DatatypeProperty
sub property of: topDataProperty
domain: Service
range: string
comment: Orari di ultima rilevazione, e di rilevazione di un valore estremo, di umidità, precipitazioni, temperatura e vento. @it
comment: Times of last detection, and times of detection of extreme values, of humidity, precipitation, temperature and wind.
label: Orario @it

Time humidity observation
type: DatatypeProperty
sub property of: Time
comment: Orari di ultima rilevazione, e di rilevazione di un valore estremo, di umidità. @it
comment: Times of last detection, and times of detection of extreme values, of humidity.
label: Orario @it

Time humidity last observation
type: DatatypeProperty
sub property of: Time humidity observation
comment: Orario in cui è stata eseguita la più recente rilevazione del livello di umidità nell'aria. @it
comment: Time of last detection of the humidity.
label: Orario ultima rilevazione umidità @it

Time last temperature observation
type: DatatypeProperty
sub property of: Time temperature observation
comment: Orario in cui è stata eseguita la più recente rilevazione della temperatura. @it
comment: Time when the most recent temperature test was performed.
label: Orario ultima rilevazione temperatura @it

Time wind last observation
type: DatatypeProperty
sub property of: Time wind observation
comment: Orario in cui è stata eseguita la più recente rilevazione della velocità del vento. @it
comment: The time when the latest wind speed detection was performed.
label: Orario ultima rilevazione vento @it

Time rainfall last observation
type: DatatypeProperty
sub property of: Time
comment: Orario in cui è stata eseguita la più recente rilevazione delle precipitazioni. @it
comment: The most recent rainfall detection.
label: Orario ultima rilevazione precipitazioni @it

Time temperature observation
type: DatatypeProperty
sub property of: Time
comment: Orari di ultima rilevazione, e di rilevazione di un valore estremo, di temperatura. @it
comment: Times of last detection, and times of detection of extreme values, of temperature.
label: Orario @it

Time today max humidity
type: DatatypeProperty
sub property of: Time humidity observation
comment: Orario in cui è stata rilevata la massima concentrazione di umidità nell'aria nel corso della giornata. @it
comment: Time when the maximum humidity concentration in the air was detected during the day.
label: Orario massima umidità @it

Time today max temperature
type: DatatypeProperty
sub property of: Time temperature observation
comment: Orario in cui è stata rilevata la massima temperatura nel corso della giornata. @it
comment: The time when the maximum temperature was detected during the day.
label: Orario massima temperatura @it

Time today max wind velocity
type: DatatypeProperty
sub property of: Time wind observation
comment: Orario in cui è stata rilevata la massima ventosità nel corso della giornata. @it
comment: The time when the maximum windiness was detected during the day.
label: Orario massima ventosità @it

Time today min humidity
type: DatatypeProperty
sub property of: Time humidity observation
comment: Orario in cui è stata rilevata la minima concentrazione di umidità nell'aria nel corso della giornata. @it
comment: The time when the lowest concentration of humidity in the air was detected during the day.
label: Orario minima umidità @it

Time today min temperature
type: DatatypeProperty
sub property of: Time temperature observation
comment: Orario in cui è stata rilevata la minima temperatura nel corso della giornata. @it
comment: Time when the minimum temperature was detected during the day.
label: Orario minima temperatura @it

Time water level observation
type: DatatypeProperty
sub property of: Time
comment: Orario in cui è stata eseguita la più recente rilevazione del livello delle acque. @it
comment: Time when the most recent water level detection was performed.
label: Orario ultima rilevazione livello acqua @it

Time wind observation
type: DatatypeProperty
sub property of: Time
comment: Orari di ultima rilevazione, e di rilevazione di un valore estremo, di velocità del vento. @it
comment: Times of last detection, and times of detection of extreme values, of windness.
label: Orario @it

Time yesterday max humidity
type: DatatypeProperty
sub property of: Time humidity observation
comment: Orario in cui è stata rilevata la massima concentrazione di umidità nell'aria nel corso della giornata precedente. @it
comment: The time when the highest humidity concentration was detected during the previous day.
label: Orario massima umidità giornata precedente @it

Time yesterday max temperature
type: DatatypeProperty
sub property of: Time temperature observation
comment: Orario in cui è stata rilevata la massima temperatura nel corso della giornata precedente. @it
comment: The time when the maximum temperature was detected during the previous day.
label: Orario massima temperatura giornata precedente @it

Time yesterday max wind velocity
type: DatatypeProperty
sub property of: Time wind observation
comment: Orario in cui è stata rilevata la massima ventosità nel corso della giornata precedente. @it
comment: The time when the maximum windiness was detected during the previous day.
label: Orario massima ventosità giornata precedente @it

time yesterday min humidity
type: DatatypeProperty
sub property of: Time humidity observation
comment: Orario in cui è stata rilevata la minima concentrazione di umidità nell'aria nel corso della giornata precedente. @it
comment: Time when the lowest humidity concentration was detected during the previous day.
label: Orario minima umidità giornata precedente @it

Time yesterday min temperature
type: DatatypeProperty
sub property of: Time temperature observation
comment: Orario in cui è stata rilevata la minima temperatura nel corso della giornata precedente. @it
comment: The time when the lowest temperature was detected during the previous day.
label: Orario minima temperatura giornata precedente @it

Time slot
type: DatatypeProperty
domain: Weather Report
range: string
comment: Intervallo temporale della durata di un secondo, solitamente utilizzato come istante di tempo, per fornire una collocazione temporale ad un generico evento. ANCHE SE VERRA' INSERITO IL COLLEGAMENTO CON INSTANT, QUESTO ATTRIBUTO NON VA CANCELLATO. @it
comment: One-second time interval, usually used as a time instant, to provide time allocation to a generic event. EVEN IF INSTANT IS INTRODUCED, THIS ATTRIBUTE MUST BE PRESERVED.
label: Slot di tempo @it

Today max humidity
type: DatatypeProperty
sub property of: Humidity
comment: It provides the maximum value of humidity detected by the weather station throughout the day.
comment: Riporta il massimo valore di umidità rilevato dalla stazione meteo nell'arco della giornata. @it
label: Umidità massima @it

Today max water level
type: DatatypeProperty
sub property of: Water level
comment: It indicates the highest level of water detected in the day.
comment: Riporta il livello massimo delle acque registrato nella giornata. @it
label: Livello massimo giornaliero @it

Today max wind average speed
type: DatatypeProperty
sub property of: Wind average speed
comment: Average windness of the day, determined by averaging the peaks.
comment: Velocità media del vento nella giornata, determinata mettendo in media i picchi massimi. @it
label: Velocità media del vento nella giornata @it

Today max wind direction
type: DatatypeProperty
sub property of: Wind direction
comment: It provides the wind direction detected at the peak windness of the day.
comment: Riporta la direzione del vento individuata nel momento del picco massimo di velocità del vento nella giornata. @it
label: Direzione del picco di vento nella giornata @it

Today max wind gust speed
type: DatatypeProperty
sub property of: Wind gust speed
comment: Riporta la massima velocità gust del vento rilevata nell'arco della giornata. @it
comment: Windness detected by equally fractionating the day and considering for each fraction the peak value only.
label: Massima velocità gust del vento giornata corrente @it

Today min humidity
type: DatatypeProperty
sub property of: Humidity
comment: It provides the minimum moisture value detected by the weather station throughout the day.
comment: Riporta il minimo valore di umidità rilevato dalla stazione meteo nell'arco della giornata. @it
label: Umidità minima @it

Today min water level
type: DatatypeProperty
sub property of: Water level
comment: It indicates the lowest level of water detected in the day.
comment: Riporta il livello minimo delle acque registrato nella giornata. @it
label: Livello minimo giornaliero @it

Tourist bus
type: DatatypeProperty
domain: Lanes count
range: integer
comment: La proprietà indica il numero delle corsie riservate ai bus da turismo. @it
comment: The property indicates the number of the lanes that are designated for the tourist bus.
label: Bus da turismo @it

Track type
type: DatatypeProperty
domain: Railway Element
range: string
comment: Indica se il tratto è a binario singolo o a binario doppio. @it
comment: Indicates whether the railway section is single track or double track.
label: Tipo binario @it

Traffic dir
type: DatatypeProperty
domain: Road element
range: string
comment: Indica se il tratto di strada può essere percorso in una soltanto o in entrambe le direzioni. @it
comment: It indicates whether the road section can be traveled in one or both directions.
label: Direzione del traffico @it

Turn
type: DatatypeProperty
domain: Lane
range: string
comment: La proprietà specifica una restrizione di svolta per la specifica corsia. @it
comment: The property specifies a turn restriction for the specific lane.
label: Svolta @it

Type
type: DatatypeProperty
domain: Service
range: string
comment: Fornisce una prima indicazione circa il servizio erogato, tuttavia non destinata ad essere mostrata tal quale agli utenti. @it
comment: It provides a first indication about the service delivered but is not intended to be shown to users.
label: Tipo @it

Type label
type: DatatypeProperty
domain: Thing
range: string
comment: Fornisce una prima descrizione del servizio erogato, destinata ad essere mostrata agli utenti e pertanto disponibile in più lingue. @it
comment: It provides a first description of the service provided, intended to be displayed to users and therefore available in multiple languages.
label: Etichetta del tipo @it

Type of resale
type: DatatypeProperty
domain: Transverse Service
range: string
comment: Individua il tipo di rivendita di biglietti del TPL (bar, libreria, tabacchi, cartoleria, e così via). @it
comment: It describes the type of resale of TPL tickets (bars, bookstores, tobacconists, stationery, etc.).
label: Tipo di rivendita @it

Typical irrigation time
type: DatatypeProperty
comment: It indicates the usual time when the irrigator comes into operation.
comment: Riporta l'orario abituale in cui l'irrigatore entra in funzione. @it
label: Orario di irrigazione @it

Underpass
type: DatatypeProperty
domain: Railway Element
range: string
comment: Indica se il tratto di ferrovia si trovi o meno all'interno di un sottopasso. @it
comment: It indicates whether the railroad section is within a subway.
label: Sottopasso @it

Undesignated
type: DatatypeProperty
domain: Lanes count
range: integer
comment: La proprietà indica il numero delle corsie che non sono riservate ad una particolare categoria di utenza. @it
comment: The property indicates the number of the undesignated lanes.
label: Non riservate @it

User tag ID
type: DatatypeProperty
domain: Smart waste container observation
comment: An identifier for the smart waste container user.
comment: Identificativo dell'utente che esegue il conferimento nel contenitore per rifiuti dotato di funzionalità avanzate. @it
label: ID Utente @it

Username
type: DatatypeProperty
domain: Message Broker
range: string
comment: Il nome utente che dovrebbe essere utilizzato per accedere al broker. @it
comment: The username that should be used for accessing the broker.
label: Nome utente @it

Uuid
type: DatatypeProperty
domain: Beacon
range: string
comment: Identificativo che, assieme al major e al minor, individua univocamente il dispositivo Beacon. @it
comment: Identifier that, together with major and minor, uniquely identifies the Beacon device.

Uv
type: DatatypeProperty
domain: Weather prediction
range: string
comment: Forecast about the intensity of UV rays.
comment: Previsione circa l'intensità dei raggi UV. @it

Validity status
type: DatatypeProperty
domain: Situation Record of a Car Park
range: string
comment: Fornisce un'indicazione circa il fatto che il rilevamento della situazione del parcheggio sia attivo o meno. @it
comment: It indicates whether the parking sensor is active or not.
label: Validità dello stato @it

Value
type: DatatypeProperty
domain: StatisticalData
range: string
comment: It indicates the resulting value from the statistical detection.
comment: Riporta il valore risultante dalla rilevazione statistica. @it
label: Valore @it

Value bounds
type: DatatypeProperty
domain: Device attribute
range: string
comment: In those cases when the healthy of the device is evaluated checking that its output falls within a specific interval of valid values, this property indicates the interval of the valid values.
comment: Nel caso in cui la salute del dispositivo sia verificata accertandosi che produca degli output che ricadono all'interno di uno specifico intervallo di valori ammissibili, questa proprietà indica qual'è l'intervallo dei valori ammissibili. @it
label: Intervallo di valori ammesso @it

Attribute name
type: DatatypeProperty
domain: Device attribute
range: string
comment: Name of an attribute of a device.
comment: Nome di un attributo di un dispositivo. @it
label: Nome attributo @it

Value refresh rate
type: DatatypeProperty
domain: Device attribute
range: integer
comment: Indica il tempo espresso in secondi che intercorre tra due chiamate consecutive dello stesso processo. @it
comment: It indicates the time expressed in seconds between two consecutive calls of the same process.
label: Frequenza di aggiornamento @it

Unit of measure
type: DatatypeProperty
domain: Device attribute
range: string
comment: L'unità di misura in cui l'attributo è espresso. @it
comment: The unit of measure in which the attribute is expressed.
label: Unità di misura @it

Vehicle
type: DatatypeProperty
domain: AVM Record
range: string
comment: Identificativo univoco di un automezzo del trasporto pubblico locale. @it
comment: Unique identifier of a local public transport vehicle.
label: Veicolo @it

Vehicle flow
type: DatatypeProperty
domain: Traffic observation
range: string
comment: It indicates the flow of vehicles detected by the traffic sensor.
comment: Riporta il flusso dei veicoli rilevato dal sensore di traffico. @it
label: Flusso veicoli @it

Waste level
type: DatatypeProperty
domain: Smart waste container observation
comment: It indicates the fill level of the waste bin with advanced features.
comment: Riporta il livello di riempimento del contenitore per i rifiuti dotato di funzionalità avanzate. @it
label: Riempimento @it

Water level
type: DatatypeProperty
sub property of: topDataProperty
comment: Indicatori relativi al monitoraggio delle acque interne. @it
comment: Indicators relating to inland water monitoring.
label: Livello delle acque @it

Water level variation
type: DatatypeProperty
sub property of: Water level
comment: Variations detected in the water level sampled every 1, 3, or 6, hours.
comment: Variazioni rilevate nel livello delle acque campionato ad intervalli di 1, 3, 6 ore. @it
label: Variazione del livello delle acque @it

Water level variation last 1 hour
type: DatatypeProperty
sub property of: Water level variation
comment: Variations detected in the water level sampled at every hour.
comment: Variazione rilevata del livello delle acque campionato ad intervalli di 1 ora. @it
label: Variazione livello acque 1h @it

Water level variation last 3 hours
type: DatatypeProperty
sub property of: Water level variation
comment: Variations detected in the water level sampled every 3 hours.
comment: Variazione rilevata del livello delle acque campionato ad intervalli di 3 ore. @it
label: Variazione livello acque 3h @it

Water level variation last 6 hours
type: DatatypeProperty
sub property of: Water level variation
comment: Variations detected in the water level sampled every 6 hours.
comment: Variazione rilevata del livello delle acque campionato ad intervalli di 6 ore. @it
label: Variazione livello acque 6h @it

What
type: DatatypeProperty
domain: Limitations
range: string
comment: La proprietà indica a che cosa il limite si riferisce. @it
comment: The property specifies to what the limit refers.
label: Cosa @it

White code count
type: DatatypeProperty
domain: First Aid state
range: integer
comment: Number of patients admitted to White Emergency Assistance.
comment: Numero dei pazienti ricoverati presso il Pronto Soccorso in codice bianco. @it
label: Pazienti in codice bianco @it

Who
type: DatatypeProperty
domain: Access restriction
range: string
comment: La proprietà specifica le categorie di utenza a cui la restrizione si applica. @it
comment: The property specifies the categories of vehicles to which the restriction applies.
label: Chi @it

Width
type: DatatypeProperty
domain: Road element
range: string
comment: Larghezza del tratto di strada (elemento stradale). @it
comment: Road section width.
label: Larghezza @it

Wind
type: DatatypeProperty
domain: Weather prediction
range: string
comment: Expected windness.
comment: Intensità del vento prevista. @it
label: Vento @it

Wind average speed
type: DatatypeProperty
sub property of: topDataProperty
comment: Average windness.
comment: Velocità media del vento @it
label: Velocità media del vento @it

Wind direction
type: DatatypeProperty
sub property of: topDataProperty
comment: Direzione del vento @it
comment: Wind direction
label: Direzione del vento @it

Wind gust speed
type: DatatypeProperty
sub property of: topDataProperty
comment: Velocità determinata frazionando il tempo in finestre consecutive di uguale durata, e considerando per ciascuna finestra soltanto il valore di picco massimo. @it
comment: Windness detected by equally fractionating the time and considering for each fraction the peak value only.
label: Velocità gust @it

Yard type
type: DatatypeProperty
domain: Goods Yard
range: string
comment: It indicates whether the goods yard is public or private.
comment: Riporta il tipo di scalo ferroviario, se pubblico o privato. @it
label: Tipo di scalo @it

Year
type: DatatypeProperty
domain: Resolution
range: string
comment: It indicates the year when the resolution was approved.
comment: Riporta l'anno in cui la delibera è stata approvata. @it
label: Anno @it

Yellow code count
type: DatatypeProperty
domain: First Aid state
range: integer
comment: Number of patients admitted to First Aid in Yellow Code.
comment: Numero dei pazienti ricoverati in Pronto Soccorso in codice giallo. @it
label: Pazienti in codice giallo @it

Yesterday max humidity
type: DatatypeProperty
sub property of: Humidity
comment: It provides the maximum value of humidity detected by the weather station over the previous day.
comment: Riporta il massimo valore di umidità rilevato dalla stazione meteo nell'arco della giornata precedente. @it
label: Umidità massima giorno precedente @it

Yesterday max water level
type: DatatypeProperty
sub property of: Water level
comment: Maximum water level recorded over the previous day.
comment: Valore massimo del livello delle acque registrato nell'arco della giornata precedente. @it
label: Massimo livello acque giornata precedente @it

Yesterday max wind average speed
type: DatatypeProperty
sub property of: Wind average speed
comment: Average windness of the previous day, determined by averaging the peaks.
comment: Velocità media del vento nella giornata precedente, determinata mettendo in media i picchi massimi. @it
label: Velocità media del vento nella giornata precedente. @it

Yesterday max wind direction
type: DatatypeProperty
sub property of: Wind direction
comment: It provides the wind direction detected at the peak windness of the previous day.
comment: Riporta la direzione del vento individuata nel momento del picco massimo di velocità del vento nella giornata precedente @it
label: Direzione del picco di vento nella giornata precedente @it

Yesterday max wind gust speed
type: DatatypeProperty
sub property of: Wind gust speed
comment: Riporta la massima velocità gust del vento rilevata nell'arco della giornata precedente. @it
comment: Windness detected by equally fractionating the previous day and considering for each fraction the peak value only.
label: Massima velocità gust del vento giornata precedente @it

Yesterday min humidity
type: DatatypeProperty
sub property of: Humidity
comment: It provides the minimum value of humidity detected by the weather station over the previous day.
comment: Riporta il minimo valore di umidità rilevato dalla stazione meteo nell'arco della giornata precedente. @it
label: Umidità minima giornata precedente @it

Yesterday min water level
type: DatatypeProperty
sub property of: Water level
comment: Minimum water level recorded over the previous day.
comment: Valore minimo del livello delle acque registrato nell'arco della giornata precedente. @it
label: Minimo livello delle acque giornata precedente @it

latitude
type: DatatypeProperty
domain: SpatialThing
comment: Latitudine WGS84 espressa come valore decimale. @it
comment: The WGS84 latitude of a SpatialThing (decimal degrees).
label: latitudine @it

longitude
type: DatatypeProperty
domain: SpatialThing
comment: Longitudine WGS84 espressa come numero decimale. @it
comment: The WGS84 longitude of a SpatialThing (decimal degrees).
label: longitudine @it

Business Entity
type: Class
subclass of: SpatialThing
comment: GoodRelation: This class represents the legal agent making (or seeking) a particular offering. This can be a legal body or a person. A business entity has at least a primary mailing address and contact

Event
type: Class
comment: Classe esterna: http://schema.org/Event @it
comment: External class: http://schema.org/Event

Place
type: Class
comment: Classe esterna: http://schema.org/Place @it
comment: External class: http://schema.org/Place

AMQP Broker
type: Class
subclass of: Message Broker
subclass of: Restriction
  on property: AMQP Queue
  min qualified cardinality: 1
  on data range: string
comment: It represents a hardware/software component that acts as an interface between a device or a set of devices (sensors, actuators) and the external, implementing the AMQP protocol.
comment: Modella un componente hardware/software che agisce da interfaccia tra un dispositivo o un insieme di dispositivi (sensori, attuatori) e il mondo esterno implementando il protocollo AMQP. @it
label: Broker AMQP @it

AVM Record
type: Class
subclass of: SpatialThing
subclass of: Restriction
  on property: On route
  qualified cardinality: 1
  on class: Route
subclass of: Restriction
  on property: latitude
  qualified cardinality: 1
  on data range: float
subclass of: Restriction
  on property: longitude
  qualified cardinality: 1
  on data range: float
comment: Corsa programmata da una certa azienda TPL su un certo percorso di una certa linea
label: Registrazione AVM @it

Access restriction
type: Class
subclass of: Restriction
comment: Le istanze di questa classe rappresentano una restrizione di accesso in vigore su di una strada o su di un tratto di strada. @it
comment: The instances of this class represent each an access restriction that applies to a road or to a segment of road.
label: Restrizioni di accesso @it

Accommodation
type: Class
subclass of: Service
comment: Alberghi e strutture simili. @it
comment: Hotels and similar structures.
label: Alloggio @it

Accommodation or office containers rental
type: Class
subclass of: Utilities and supply
comment: Le istanze di questa classe rappresentano, tra tutte le attività d'impresa, talune aziende che si occupano del noleggio dei container per gli alloggi e per gli uffici. @it
comment: The instances of this class represent, among all business activities, some companies that deal with rental of containers for housing and offices.
label: Noleggio Container per alloggi o uffico @it

Accountants
type: Class
subclass of: Financial Service
comment: Le istanze di questa classe rappresentano, tra tutte le attività d'impresa, taluni studi commerciali, tributari e di revisione contabile. @it
comment: The instances of this class represent, among all the business activities, certain commercial, tax and audit firms.
label: Ragionieri Commercialisti e periti commerciali @it

Addiction recovery centre
type: Class
subclass of: Health Care
comment: Le istanze di questa classe rappresentano, tra tutte le attività d'impresa, talune comunità e centri di recupero dalle dipendenze. @it
comment: The instances of this class represent, among all business activities, certain communities and recuperation centers from dependencies.
label: Comunita e centri di recupero per dipendenze @it

Administrative Road
type: Class
disjoint with: Road element
comment: Class whose instances are the administrative extents defined in the road graph.
comment: Classe le cui istanze sono le estese amministrative definite nel grafo stradale. @it
label: Estesa Amministrativa @it

Adult Clothing
type: Class
subclass of: Shopping and service
comment: Le istanze di questa classe rappresentano, tra tutte le attività d'impresa, talune aziende di commercio al dettaglio di abbigliamento per adulti. @it
comment: The instances of this class represent, among all business activities, certain retail clothing stores for adults.
label: Abbigliamento Uomo Donna @it

Advertising
type: Class
subclass of: Service
comment: Advertising-related services.
comment: Servizi legati al mondo della pubblicità. @it
label: Pubblicita' @it

Advertising and promotion
type: Class
subclass of: Advertising
comment: Le istanze di questa classe rappresentano, tra tutte le attività d'impresa, talune concessionarie ed aziende pubblicitarie. @it
comment: The instances of this class represent, among all business activities, certain dealerships and advertising companies.
label: Pubblicita' e Concessionarie @it

Aestestic medicine centre
type: Class
subclass of: Health Care
comment: Le istanze di questa classe rappresentano, tra tutte le attività d'impresa, taluni centri di medicina estetica. @it
comment: The instances of this class represent, among all business activities, certain aestestic medicine centres.
label: Centro di medicina estetica @it

Agents
type: Class
subclass of: Utilities and supply
comment: Le istanze di questa classe rappresentano, tra tutte le attività d'impresa, talune agenzie ed agenti o procuratori per lo spettacolo e lo sport. @it
comment: The instances of this class represent, among all business activities, certain agencies and agents for the show and sport.
label: Agenti e procuratori @it

Agriculture and livestock
type: Class
subclass of: Service
comment: Activities and services relating to agriculture and livestock farming.
comment: Attività e servizi relativi ad agricoltura ed allevamento. @it
label: Agricoltura ed allevamento @it

Agritourism
type: Class
subclass of: Accommodation
comment: Le istanze di questa classe rappresentano, tra tutte le attività d'impresa, talune attività di ristorazione ed alloggio connesse alle attività agricole. @it
comment: The instances of this class represent, among all the business activities, certain catering and accommodation activities related to agricultural activities.
label: Agriturismo @it

Air quality observation
type: Class
subclass of: Observation
comment: Ciascuna istanza di questa classe rappresenta una rilevazione della qualità dell'aria. @it
comment: Each instance of this class represents an air quality detection.
label: Osservazione della qualità dell'aria @it

Air quality monitoring station
type: Class
subclass of: Environment
comment: Le istanze di questa classe rappresentano i rilevatori dei livelli di polveri sottili nell'aria. Ciascuna istanza rappresenta uno specifico rilevatore, di una specifica tipologia, collocato in una specifica posizione individuata attraverso una coppia di coordinate geospaziali. Per contro, per ciascun rilevatore esiste al più una sola istanza che lo rappresenta. @it
comment: The instances of this class are dust-level detectors in the air. Each instance represents a specific detector, of a specific type, located in a specific location located through a pair of geospatial coordinates. On the other hand, for each detector there is at most one instance representing it.
label: Stazione di monitoraggio della qualità dell'aria @it

Airfields
type: Class
subclass of: Transfer service and renting
comment: Le istanze di questa classe rappresentano, tra tutte le sedi di servizi, talune avio-superfici. @it
comment: The instances of this class represent, among all service locations, some airfields.
label: Aviosuperfici @it

Airplanes rental
type: Class
subclass of: Transfer service and renting
comment: Le istanze di questa classe rappresentano, tra tutte le attività d'impresa, talune attività di noleggio di mezzi di trasporto aereo. @it
comment: The instances of this class represent, among all business activities, certain chartering activities of air transport.
label: Noleggio aerei @it

Airport lost property office
type: Class
subclass of: Government Office
comment: Le istanze di questa classe rappresentano, tra tutte le attività d'impresa, taluni uffici per gli oggetti smarriti in aeroporto. @it
comment: The instances of this class represent, among all service locations, some offices for lost items at the airport.
label: Ufficio oggetti smarriti aeroporto @it

Amusement activities
type: Class
subclass of: Entertainment
comment: Le istanze di questa classe rappresentano, tra tutte le attività d'impresa, talune attività creative, artistiche e di intrattenimento. @it
comment: The instances of this class represent, among all the business activities, some creative, artistic and entertainment activities.
label: Attivita' ricreative @it

Amusement and theme parks
type: Class
subclass of: Entertainment
comment: Le istanze di questa classe rappresentano, tra tutte le attività d'impresa, taluni parchi di divertimento e a tema. @it
comment: The instances of this class represent, among all business activities, some amusement and themed parks.
label: Parchi divertimento e tematici @it

Anemometry observation
type: Class
subclass of: Observation
comment: Ciascuna istanza di questa classe rappresenta una rilevazione della velocità e della direzione del vento. @it
comment: Each instance of this class represents a speed and wind direction detection.
label: Rilevazione con anemometro @it

Animal Feeds Manufacture
type: Class
subclass of: Industry and manufacturing
comment: Le istanze di questa classe rappresentano, tra tutte le attività d'impresa, talune aziende che producono alimenti per animali. @it
comment: The instances of this class represent, among all business activities, some companies that produce animal feed.
label: Produzione Mangimi @it

Animal Production
type: Class
subclass of: Agriculture and livestock
comment: Le istanze di questa classe rappresentano, tra tutte le attività d'impresa, talune aziende di allevamento di animali. @it
comment: The instances of this class represent, among all business activities, some animal breeding companies.
label: Produzione Animali @it

Antiques
type: Class
subclass of: Shopping and service
comment: Le istanze di questa classe rappresentano, tra tutte le attività d'impresa, talune aziende di commercio al dettaglio di mobili usati e di oggetti di antiquariato. @it
comment: The instances of this class represent, among all business activities, certain retail companies of used furniture and antiques.
label: Antichita' @it

Aquarium
type: Class
subclass of: Entertainment
comment: Le istanze di questa classe rappresentano, tra tutte le sedi di servizi, taluni acquari. @it
comment: The instances of this class represent, among all service locations, some aquariums.
label: Acquario @it

Archaeological site
type: Class
subclass of: Cultural Activity
comment: Le istanze di questa classe rappresentano, tra tutte le attività d'impresa, taluni siti archeologici. @it
comment: The instances of this class represent, among all business activities, certain archaeological sites.
label: Sito archeologico @it

Architectural consulting
type: Class
subclass of: Civil and edil engineering
comment: Le istanze di questa classe rappresentano, tra tutte le attività d'impresa, talune attività degli studi di architettura. @it
comment: The instances of this class represent, among all the business activities, some activities of architectural studies.
label: Studi di Architettura @it

Polygonal Service
type: Class
subclass of: Service
comment: Services represented by a polygonal form area.
comment: Servizi rappresentati da un'area di forma poligonale. @it
label: Servizio di forma poligonale @it

Art Galleries
type: Class
subclass of: Shopping and service
comment: Le istanze di questa classe rappresentano, tra tutte le attività d'impresa, talune aziende di commercio al dettaglio degli oggetti d'arte incluse le gallerie d'arte. @it
comment: The instances of this class represent, among all the business activities, certain retail companies of art objects including art galleries.
label: Gallerie Arte @it

Artisanshop
type: Class
subclass of: Shopping and service
comment: Le istanze di questa classe rappresentano, tra tutte le attività d'impresa, talune botteghe artigiane. @it
comment: The instances of this class represent, among all the business activities, some craft workshops.
label: Negozio artigiano @it

Assistance
type: Class
subclass of: Health Care
comment: Le istanze di questa classe rappresentano, tra tutti i servizi, taluni servizi di assistenza alla persona. @it
comment: The instances of this class represent, among all the services, some personal assistance services.
label: Assistenza @it

Associations
type: Class
subclass of: Utilities and supply
comment: Le istanze di questa classe rappresentano, tra tutte le attività d'impresa, talune attività di organizzazioni associative dedite anche, in via residuale, allo svolgimento di attività economiche. @it
comment: The instances of this class represent, among all the business activities, certain business activities carried out by associative organizations.
label: Associazioni @it

Atm
type: Class
subclass of: Financial Service
comment: Le istanze di questa classe rappresentano, tra tutti i servizi, gli sportelli Bancomat. @it
comment: The instances of this class represent, among all services, ATMs.

Auctioning Houses
type: Class
subclass of: Shopping and service
comment: Le istanze di questa classe rappresentano, tra tutte le attività d'impresa, talune case d'asta al dettaglio, escluse le case d'asta via Internet. @it
comment: The instances of this class represent, among all business activities, some retail auction houses, excluding auction houses via the Internet.
label: Case d'Asta @it

Audio and Video
type: Class
subclass of: Shopping and service
comment: Le istanze di questa classe rappresentano, tra tutte le attività d'impresa, talune attività di commercio al dettaglio di apparecchiature audio e video in esercizi specializzati. @it
comment: The instances of this class represent, among all business activities, certain retail and wholesale activities of audio and video equipment in specialized stores.
label: Audio e Video @it

Auditing activities
type: Class
subclass of: Financial Service
comment: Le istanze di questa classe rappresentano, tra tutte le attività d'impresa, talune attività di revisione e certificazione di bilanci. @it
comment: The instances of this class represent, among all business activities, some auditing activities.
label: Revisione e cerificazione bilanci @it

Auditorium
type: Class
subclass of: Cultural Activity
comment: Le istanze di questa classe rappresentano, tra tutte le attività d'impresa, taluni auditorium. @it
comment: The instances of this class represent, among all the business activities, some auditoriums.

Automobile driving and flying schools
type: Class
subclass of: EducationAndResearch
comment: Le istanze di questa classe rappresentano, tra tutte le attività d'impresa, talune autoscuole, scuole di pilotaggio e scuole nautiche. @it
comment: The instances of this class include, among all business activities, some driving, flying and nautical schools.
label: Autoscuole, scuole di pilotaggio e nautiche @it

Bakery
type: Class
subclass of: Wine And Food
comment: Le istanze di questa classe rappresentano, tra tutte le attività d'impresa, talune attività di vendita al dettaglio del pane, ed inoltre di torte, dolciumi e confetteria. @it
comment: The instances of this class represent, among all business activities, certain bread retail activities, as well as pies, sweets and confectionery.
label: Forno @it

Bank
type: Class
subclass of: Financial Service
comment: Le istanze di questa classe rappresentano, tra tutte le attività d'impresa, taluni istituti di credito e le attività di servizio finanziario in genere. @it
comment: The instances of this class represent, among all business activities, some lenders and financial service activities in general.
label: Banca @it

Bar
type: Class
subclass of: Wine And Food
comment: Le istanze di questa classe rappresentano, tra tutte le attività d'impresa, taluni bar e altri esercizi simili senza cucina. @it
comment: The instances of this class include, among all business activities, certain bars and other similar exercises without cooking.

Beach
type: Class
subclass of: Entertainment
comment: Le istanze di questa classe rappresentano, tra tutte le attività d'impresa, talune spiagge. @it
comment: The instances of this class represent, among all business activities, some bathing establishments. @it
label: Spiaggia @it

Beach resort
type: Class
subclass of: Accommodation
comment: Le attività di questo tipo rappresentano, tra tutte le sedi di servizi, taluni stabilimenti balneari. @it
comment: Such activities represent, among all service locations, some bathing establishments.
label: Stabilimento balneare @it

Beacon
type: Class
subclass of: Tourism Services
subclass of: SpatialThing
comment: Service associated to Beacon that allow to receive offers.
comment: Servizio associato ai Beacon che permettono di ricevere offerte. @it
comment: Single Beacon installed.
comment: Singolo beacon installato. @it

Beacon observation
type: Class
subclass of: SpatialThing
comment: lettura proveniente da un singolo beacon
label: Lettura di un beacon @it

Beauty centre
type: Class
subclass of: Shopping and service
comment: Le istanze di questa classe rappresentano, tra tutte le attività d'impresa, taluni servizi degli istituti di bellezza. @it
comment: The instances of this class represent, among all the business activities, certain services of beauty institutes.
label: Istituti di bellezza @it

Bed and breakfast
type: Class
subclass of: Accommodation
comment: Le istanze di questa classe rappresentano, tra tutte le attività d'impresa, talune attività di alloggio in bed and breakfast. @it
comment: The instances of this class represent, among all business activities, certain lodging activities in bed and breakfast.

Bench
type: Class
subclass of: Entertainment
comment: Ciascuna istanza di questa classe rappresenta una panchina. @it
comment: Each instance of this class represents a bench.
label: Panchina @it

Betting shops
type: Class
subclass of: Entertainment
comment: Le istanze di questa classe rappresentano, tra tutte le attività d'impresa, talune ricevitorie di scommesse. @it
comment: The instances of this class represent, among all business activities, certain betting shops.
label: Ricevitorie @it

Beverage Manufacture
type: Class
subclass of: Industry and manufacturing
comment: Le istanze di questa classe rappresentano, tra tutte le attività d'impresa, talune attività di produzione di bevande. @it
comment: The instances of this class represent, among all business activities, certain beverage production activities.
label: Produzione Bevande @it

Bike rack observation
type: Class
subclass of: Observation
comment: Ciascuna istanza di questa classe rappresenta una rilevazione dei posti disponibili in una rastrelliera per biciclette in un certo istante. @it
comment: Each instance of this class represents a finding of places available in a bicycle rack at a given instant.
label: Rilevazione su rastrelliera per biciclette @it

Bike rack
type: Class
subclass of: Transfer service and renting
comment: Ciascuna istanza di questa classe rappresenta un portabiciclette. @it
comment: Each instance of this class represents a bike rack.
label: Rastrelliera per biciclette @it

Bike rental
type: Class
subclass of: Transfer service and renting
comment: Le istanze di questa classe rappresentano, tra tutte le attività d'impresa, talune attività di noleggio di biciclette. @it
comment: The instances of this class represent, among all business activities, some bicycle rental activities.
label: Punto noleggio bici @it

Bike sharing rack
type: Class
subclass of: Bike rental
subclass of: Transfer service and renting
comment: Ciascuna istanza di questa classe rappresenta una rastrelliera da cui è possibile prelevare ed in cui è possibile riporre le biciclette prese a noleggio. @it
comment: Each instance of this class represents a bike rack from where bikes can be taken on loan, or can be left after that they have been loaned.
label: Rastrelliera per bike sharing @it

Boarding house
type: Class
subclass of: Accommodation
comment: Le istanze di questa classe rappresentano, tra tutte le attività d'impresa, talune attività di affittacamere. @it
comment: The instances of this class represent, among all the business activities, certain guest houses.
label: Affittacamere @it

Boat equipment
type: Class
subclass of: Shopping and service
comment: Le istanze di questa classe rappresentano, tra tutte le attività d'impresa, talune attività di commercio al dettaglio di natanti e accessori. @it
comment: The instances of this class represent, among all business activities, certain retail and boat related activities.
label: Articoli per natanti @it

Boats and ships rental
type: Class
subclass of: Transfer service and renting
comment: Le istanze di questa classe rappresentano, tra tutte le attività d'impresa, talune attività di noleggio di mezzi di trasporto marittimo e fluviale. @it
comment: The instances of this class represent, among all the business activities, certain activities of renting sea and river transport.
label: Noleggio barche @it

Bollard
type: Class
subclass of: Transfer service and renting
comment: Ciascuna istanza di questa classe rappresenta un dissuasore mobile. @it
comment: Each instance of this class represents a mobile bollard.
label: Dissuasore mobile @it

Book Shop
type: Class
subclass of: Shopping and service
comment: Le istanze di questa classe rappresentano, tra tutte le attività d'impresa, talune attività di commercio al dettaglio di libri nuovi. @it
comment: The instances of this class represent, among all business activities, some retail business of new books.
label: Libreria, cartolibreria @it

Botanical and zoological gardens
type: Class
subclass of: Cultural Activity
comment: Le istanze di questa classe rappresentano, tra tutte le attività d'impresa, talune attività degli orti botanici, dei giardini zoologici e delle riserve naturali. @it
comment: The instances of this class represent, among all business activities, some activities of botanical gardens, zoological gardens and natural reserves.
label: Giardini botanici e zoologici @it

Boxoffice
type: Class
subclass of: Entertainment
comment: Le istanze di questa classe rappresentano, tra tutte le attività d'impresa, talune attività di rivendita di biglietti per eventi sportivi e di intrattenimento. @it
comment: The instances of this class include, among all business activities, some resale of tickets for sporting events and entertainment.

Building
type: Class
equivalent class: Building
subclass of: High level type
subclass of: CityObject
comment: Le istanze di questa classe rappresentano ciascuna un edificio, che può avere un'estensione spaziale tridimensionale. @it
comment: The instances of this class rapresent each a building, that can have a three-dimensional spatial extension.
label: Edificio @it

Building and industrial cleaning activities
type: Class
subclass of: Environment
comment: Le istanze di questa classe rappresentano, tra tutte le attività d'impresa, talune attività di sterilizzazione di edifici, impianti, macchinari industriali e attrezzature medico sanitarie. @it
comment: The instances of this class represent, among all business activities, certain sterilization activities of buildings, plant, industrial machinery and healthcare equipment.
label: Pulizia edifici e impianti industriali @it

Building Construction
type: Class
subclass of: Civil and edil engineering
comment: Le istanze di questa classe rappresentano, tra tutte le attività d'impresa, talune attività di progettazione e costruzione di edifici. @it
comment: The instances of this class represent, among all the business activities, certain building design and building activities.
label: Costruzione Edifici @it

Building Material
type: Class
subclass of: Shopping and service
comment: Le istanze di questa classe rappresentano, tra tutte le attività d'impresa, talune attività di commercio al dettaglio di materiali da costruzione, ceramiche, piastrelle. @it
comment: The instances of this class represent, among all the business activities, certain retail business of building materials, ceramics, tiles.
label: Materiali Edili @it

Building Materials Manufacture
type: Class
subclass of: Industry and manufacturing
comment: Le istanze di questa classe rappresentano, tra tutte le attività d'impresa, talune attività di produzione di cemento, calce, calcestruzzo, gesso ed altri composti per l'edilizia. @it
comment: The instances of this class represent, among all the business activities, certain cement, lime, concrete, gypsum and other building compounds.
label: Produzione Materiali Edili @it

Bus Stop
type: Class
subclass of: Transfer service and renting
subclass of: StopPoint
subclass of: SpatialThing
subclass of: Restriction
  on property: latitude
  qualified cardinality: 1
  on data range: float
subclass of: Restriction
  on property: longitude
  qualified cardinality: 1
  on data range: float
comment: Interconnection point between road segments to determine the path of a TPL line.
comment: Punto di interconnessione tra segmenti di strada per determinare il percorso di una linea di TPL. @it
comment: Service associated with displaying ATAF lines with their stops.
comment: Servizio associato alla visualizzazione delle linee ATAF con le relative fermate. @it
label: Fermata bus @it

BusStop Forecast
type: Class
subclass of: Restriction
  on property: At bus stop
  qualified cardinality: 1
  on class: Bus Stop
comment: Arrival forecast at a certain stop.
comment: Previsione di arrivo ad una certa fermata. @it
label: Previsione arrivo in fermata @it

Bus tickets retail
type: Class
subclass of: Transfer service and renting
comment: Le istanze di questa classe rappresentano, tra tutte le attività d'impresa, taluni servizi di rivendita dei biglietti per l'autobus. @it
comment: The instances of this class represent, among all business activities, some bus ticket resale services.
label: Rivendita biglietti autobus @it

Business support
type: Class
subclass of: Utilities and supply
comment: Le istanze di questa classe rappresentano, tra tutte le attività d'impresa, talune tipologie di attività di supporto alle imprese. si tratta principalmente di imprese di: gestione esattoriale; agenzie di distribuzione di libri, giornali e riviste; servizi di gestione di pubblici mercati e pese pubbliche; richiesta di certificati e pese pubbliche; richiesta di certificati e disbrigo pratiche. @it
comment: The instances of this class represent, among all business activities, certain types of business support activities. These are mainly companies of: exactorial management; distribution agencies of books, newspapers and magazines; services of public market management and public weights; request for certificates and public purses; request for certificates and practical drawings.
label: Sostegno alle imprese @it

Call center
type: Class
subclass of: Utilities and supply
comment: Le istanze di questa classe rappresentano, tra tutte le attività d'impresa, talune attività dei call center. @it
comment: The instances of this class represent, among all business activities, some call center activities.
label: Call Center @it

Camper service
type: Class
subclass of: Tourism Services
comment: Le istanze di questa classe rappresentano, tra tutte le attività d'impresa, talune attività di servizi per il turismo itinerante. @it
comment: The instances of this class represent, among all the business activities, certain activities of traveling tourism services.

Camping
type: Class
subclass of: Accommodation
comment: Le istanze di questa classe rappresentano, tra tutte le attività d'impresa, talune aree di parcheggio e aree attrezzate per camper e roulotte. @it
comment: The instances of this class include, among all business activities, some parking areas and areas equipped for motor homes and caravans.
label: Campeggio @it

Canteens and Food Service
type: Class
subclass of: Wine And Food
comment: Le istanze di questa classe rappresentano, tra tutte le attività d'impresa, talune mense e attività di catering continuativo su base contrattuale. @it
comment: The instances of this class represent, among all the business activities, certain canteens and continuous catering activities on a contractual basis.
label: Mense e servizi di ristorazione @it

Car Park Sensor
type: Class
comment: Sensor collecting data inside a parking lot.
comment: Sensore che raccoglie i dati all'interno di un parcheggio. @it
label: Sensore presente in parcheggio @it

Car park
type: Class
subclass of: Transfer service and renting
comment: Le istanze di questa classe rappresentano, tra tutte le attività d'impresa, talune attività di gestione di parcheggi e autorimesse. @it
comment: The instances of this class represent, among all business activities, some parking and caretaking activities.
label: Parcheggio auto @it

Car Rental With Driver
type: Class
subclass of: Transfer service and renting
comment: Le istanze di questa classe rappresentano, tra tutte le attività d'impresa, talune attività di trasporto mediante noleggio di autovetture da rimessa con conducente. @it
comment: The instances of this class represent, among all the business activities, certain transport activities by renting passenger cars with driver.
label: Noleggio Auto con Conducente @it

Car Washing
type: Class
subclass of: Shopping and service
comment: Le istanze di questa classe rappresentano, tra tutte le attività d'impresa, talune attività di lavaggio auto. @it
comment: The instances of this class represent, among all business activities, certain car wash activities.
label: Lavaggio Auto @it

Carabinieri
type: Class
subclass of: Emergency
comment: Le istanze di questa classe rappresentano, tra tutte le sedi di servizi, talune caserme dei Carabinieri. @it
comment: The instances of this class represent, among all service locations, some Carabinieri barracks.

Cargo Handling
type: Class
subclass of: Transfer service and renting
comment: Le istanze di questa classe rappresentano, tra tutte le attività d'impresa, talune attività di movimentazione merci su gomma e su rotaia. @it
comment: The instances of this class represent, among all the business activities, certain cargo handling activities on road and rail.
label: Movimentazione Merci @it

Carpentry
type: Class
subclass of: Shopping and service
comment: Le istanze di questa classe rappresentano, tra tutte le attività d'impresa, talune attività di riparazione di mobili e di oggetti di arredamento. @it
comment: The instances of this class represent, among all the business activities, some furniture repair and furnishing repair activities.
label: Falegnamerie @it

Carpets
type: Class
subclass of: Shopping and service
comment: Le istanze di questa classe rappresentano, tra tutte le attività d'impresa, talune attività di commercio al dettaglio di tappeti. @it
comment: The instances of this class represent, among all the business activities, certain carpet retail activities.
label: Tappeti @it

Carpets and Curtains
type: Class
subclass of: Shopping and service
comment: Le istanze di questa classe rappresentano, tra tutte le attività d'impresa, talune attività di commercio al dettaglio di tappeti, tende e tendine. @it
comment: The instances of this class represent, among all the business activities, some retail activities of carpets, curtains and curtains.
label: Tappeti e Tende @it

Cartographers
type: Class
subclass of: Civil and edil engineering
comment: Le istanze di questa classe rappresentano, tra tutte le attività d'impresa, talune attività di cartografia e aerofotogrammetria. @it
comment: The instances of this class represent, among all the business activities, some cartography and aerial photogrammetry activities.
label: Cartografi @it

Castle
type: Class
subclass of: Cultural Activity
comment: Le istanze di questa classe rappresentano taluni castelli in cui sono offerti servizi turistici di varia natura. @it
comment: The instances of this class represent some castles where tourist services of various kinds are offered.
label: Castello @it

Catering
type: Class
subclass of: Wine And Food
comment: Le istanze di questa classe rappresentano, tra tutte le attività d'impresa, talune attività di catering per eventi, banqueting, fornitura di pasti preparati ad uso catering ed altri servizi di ristorazione. @it
comment: The instances of this class represent, among all the business activities, certain catering activities for events, banqueting, provision of meals prepared for catering and other catering services.

Cemetery
type: Class
subclass of: Government Office
comment: Le istanze di questa classe rappresentano ciascuna un cimitero. @it
comment: The instances of this class each represent a cemetery.
label: Cimitero @it

Charge station observation
type: Class
subclass of: Observation
comment: Ciascuna istanza di questa classe rappresenta una rilevazione dello stato di una colonnina per la ricarica dei veicoli elettrici in un determinato istante. @it
comment: Each instance of this class represents a state of a column for charging electric vehicles at a given instant.
label: Rilevazione su colonnina di ricarica di veicoli elettrici @it

Charging stations
type: Class
subclass of: Transfer service and renting
comment: Le istanze di questa classe rappresentano, tra tutte le attività d'impresa, talune attività di fornitura di colonnine per la ricarica dei mezzi ad alimentazione elettrica e dei servizi collegati. @it
comment: The instances of this class represent, among all business activities, certain supply of columns for charging power supplies and related services.
label: Colonnina di ricarica @it

Charter Airlines
type: Class
subclass of: Transfer service and renting
comment: Le istanze di questa classe rappresentano, tra tutte le attività d'impresa, talune attività di trasporto aereo non di linea di passeggeri (voli charter). @it
comment: The instances of this class represent, among all business activities, some non-scheduled air transport activities (charter flights).
label: Compagnie di Charter @it

Churches
type: Class
subclass of: Cultural Activity
comment: Le istanze di questa classe rappresentano, tra tutte le sedi di servizi, taluni luoghi di culto e attività d'impresa collegate ai luoghi di culto. @it
comment: The instances of this class represent, among all the places of service, certain places of worship and business activities related to places of worship.
label: Chiese @it

Cinema
type: Class
subclass of: Entertainment
comment: Le istanze di questa classe rappresentano, tra tutte le attività d'impresa, talune attività di proiezione cinematografica. @it
comment: The instances of this class represent, among all the business activities, certain cinematic projection activities.

Civil and edil engineering
type: Class
subclass of: Service
comment: Services related to civil and construction engineering.
comment: Servizi legati all'ingegneria civile ed edile. @it
label: Ingegneria civile ed edile @it

Civil airport
type: Class
subclass of: Transfer service and renting
comment: Le istanze di questa classe rappresentano, tra tutte le attività d'impresa, talune attività esercitate dagli aeroporti civili, con particolare riferimento ai servizi di trasferimento e noleggio. @it
comment: The instances of this class represent, among all business activities, certain activities carried out by civil airports, with particular reference to transfer and rental services.
label: Aeroporto civile @it

Civil Engineering
type: Class
subclass of: Civil and edil engineering
comment: Le istanze di questa classe rappresentano, tra tutte le attività d'impresa, talune attività di ingegneria civile, ed in particolare le attività di costruzione di opere pubbliche. @it
comment: The instances of this class represent, among all the business activities, certain civil engineering activities, and in particular the activities of building public works.
label: Ingegneria Civile @it

Civil protection
type: Class
subclass of: Emergency
comment: Le istanze di questa classe rappresentano, tra tutte le sedi di servizi, talune attività di protezione civile. @it
comment: The instances of this class represent, among all service locations, certain civil protection activities.
label: Protezione civile @it

Civil registry
type: Class
subclass of: Government Office
comment: Le istanze di questa classe rappresentano, tra tutte le sedi di servizi, taluni uffici anagrafe dei comuni. @it
comment: The instances of this class represent, among all service locations, certain registry offices.
label: Anagrafe @it

Cleaning activities
type: Class
subclass of: Environment
comment: Le istanze di questa classe rappresentano, tra tutte le attività d'impresa, talune attività di pulizia e disinfestazione. @it
comment: The instances of this class represent, among all the business activities, some cleaning and disinfestation activities.
label: Pulizia @it

Cleaning Materials
type: Class
subclass of: Shopping and service
comment: Le istanze di questa classe rappresentano, tra tutte le attività d'impresa, talune attività di commercio al dettaglio di saponi, detersivi, prodotti per la lucidatura e affini. @it
comment: The instances of this class represent, among all business activities, certain retail activities of soaps, detergents, polishing products and the like.
label: Prodotti Pulizia @it

Climbing
type: Class
subclass of: Entertainment
comment: Le istanze di questa classe rappresentano, tra tutte le attività d'impresa, talune attività alpinistiche. @it
comment: The instances of this class represent, among all the business activities, some mountaineering activities.
label: Alpinismo @it

Clothing
type: Class
subclass of: Shopping and service
comment: Le istanze di questa classe rappresentano, tra tutte le attività d'impresa, talune attività di commercio al dettaglio di articoli di abbigliamento. @it
comment: The instances of this class represent, among all the business activities, some clothing retail business.
label: Abbigliamento @it

Clothing Accessories
type: Class
subclass of: Shopping and service
comment: Le istanze di questa classe rappresentano, tra tutte le attività d'impresa, talune attività di commercio al dettaglio di cappelli, ombrelli, guanti e cravatte. @it
comment: The instances of this class represent, among all business activities, certain retail activities of hats, umbrellas, gloves and ties.
label: Accessori Abbigliamento @it

Clothing and Linen
type: Class
subclass of: Shopping and service
comment: Le istanze di questa classe rappresentano, tra tutte le attività d'impresa, talune attività di commercio al dettaglio di tessuti per l'abbigliamento, l'arredamento e di biancheria per la casa. @it
comment: The instances of this class represent, among all the business activities, certain retail trade activities of clothing, home furnishings and household linen.
label: Abbigliamento e Biancheria @it

Clothing Children and Infants
type: Class
subclass of: Shopping and service
comment: The instances of this class represent, among all business activities, certain retail children's clothing.
comment: The instances of this class represent, among all the business activities, certain retail trade activities of clothing, home furnishings and household linen. @it
label: Abbigliamento Bambino @it

Clothing factory outlet
type: Class
subclass of: Shopping and service
comment: Le istanze di questa classe rappresentano, tra tutte le attività d'impresa, talune attività di spaccio e di vendita in outlet di articoli di abbigliamento. @it
comment: The instances of this class represent, among all business activities, certain activities of selling and selling outlets of clothing.
label: Spacci outlet abbigliamento @it

Coast guard harbormaster
type: Class
subclass of: Emergency
comment: Le istanze di questa classe rappresentano, tra tutte le sedi di servizi, talune sedi della Guardia costiera e della Capitaneria di porto. @it
comment: The instances of this class represent, among all service locations, certain offices of the Coast Guard and the Harbor Captain.
label: Guardia costiera capitaneria di porto @it

Coffee Rosters
type: Class
subclass of: Shopping and service
comment: Le istanze di questa classe rappresentano, tra tutte le attività d'impresa, talune attività di commercio al dettaglio di caffè torrefatto. @it
comment: The instances of this class represent, among all business activities, some rotten coffee retail business.
label: Torrefazioni @it

Coke and Petroleum Derivatives
type: Class
subclass of: Industry and manufacturing
comment: Le istanze di questa classe rappresentano, tra tutte le attività d'impresa, talune attività di raffinazione di coke e di altri prodotti derivanti dalla raffinazione del petrolio. @it
comment: The instances of this class represent, among all business activities, certain coke refining activities and other petroleum refining products.
label: Coke e Petroliferi Derivati @it

Combined facilities support activities
type: Class
subclass of: Utilities and supply
comment: Le istanze di questa classe rappresentano, tra tutte le attività d'impresa, taluni servizi integrati di gestione degli edifici. @it
comment: The instances of this class represent, among all business activities, some integrated building management services.
label: Servizi integrati di gestione agli edifici @it

Commissariat of public safety
type: Class
subclass of: Emergency
comment: Le istanze di questa classe rappresentano, tra tutte le sedi di servizi, taluni Commissariati di pubblica sicurezza. @it
comment: The instances of this class represent, among all service locations, certain Commissariats of Public Safety.
label: Commissariato di pubblica sicurezza @it

Community centre
type: Class
subclass of: Health Care
comment: Le istanze di questa classe rappresentano, tra tutte le sedi di servizi, taluni centri diurni di assistenza sanitaria. @it
comment: The instances of this class represent, among all service locations, some day health care centers.
label: Centri diurni @it

Computer data processing
type: Class
subclass of: Industry and manufacturing
comment: Le istanze di questa classe rappresentano, tra tutte le attività d'impresa, talune attività di gestione delle basi dati ed elaborazione elettronica dei dati. @it
comment: The instances of this class represent, among all business activities, certain data bases management and electronic data processing.
label: Elaborazione dati @it

Computer programming and consultancy
type: Class
subclass of: Industry and manufacturing
comment: Le istanze di questa classe rappresentano, tra tutte le attività di impresa, talune attività di produzione di software, attività di consulenza informatica, attività di configurazione e gestione di strutture e apparecchiature informatiche, ed altri servizi relativi alle tecnologie informatiche. @it
comment: The instances of this class include, among all business activities, certain software production activities, computer consultancy activities, configuration and management of facilities and computer equipment, and other IT related services.
label: Programmazione e consulenza computer @it

Computer Systems
type: Class
subclass of: Shopping and service
comment: Le istanze di questa classe rappresentano, tra tutte le attività d'impresa, talune attività di commercio al dettaglio di computer, unità periferiche, software e attrezzature per ufficio in esercizi specializzati. @it
comment: The instances of this class represent, among all business activities, certain retail business of computers, peripherals, software and office equipment in specialized stores.
label: Informatica @it

Computer technician
type: Class
subclass of: Shopping and service
comment: Le istanze di questa classe rappresentano, tra tutte le attività d'impresa, talune attività di riparazione e di manutenzione di computer e di periferiche. @it
comment: The instances of this class represent, among all business activities, some repair and maintenance of computers and peripherals.
label: Riparazione computer e periferiche @it

Conservatory
type: Class
subclass of: EducationAndResearch
comment: Le istanze di questa classe rappresentano, tra tutte le attività d'impresa, talune attività dei conservatori musicali. @it
comment: The instances of this class represent, among all the business activities, certain activities of music conservators.
label: Conservatorio @it

Consulate
type: Class
subclass of: Government Office
comment: Le istanze di questa classe rappresentano, tra tutte le sedi di servizi, taluni consolati stranieri in Italia. @it
comment: The instances of this class represent, among all service locations, some foreign consulates in Italy.
label: Consolato @it

Consulting services
type: Class
subclass of: Utilities and supply
comment: Le istanze di questa classe rappresentano, tra tutte le attività d'impresa, talune attività di consulenza in genere, ad esempio nel settore della sicurezza, dell'igiene, nel settore agrario, ed altro. @it
comment: The instances of this class represent, among all business activities, certain consulting activities in general, for example in the field of safety, hygiene, agriculture and so on.
label: Servizi di Consulenza @it

Controlled parking zone
type: Class
subclass of: Transfer service and renting
comment: Le istanze di questa classe rappresentano, tra tutte le sedi di servizi, talune zone di sosta controllata. @it
comment: The instances of this class represent, among all service locations, certain controlled parking areas.
label: Zona a sosta controllata @it

Corps of forest rangers
type: Class
subclass of: Emergency
comment: Le istanze di questa classe rappresentano, tra tutte le sedi di servizi, talune sedi del Corpo forestale dello Stato. @it
comment: The instances of this class represent, among all service locations, certain sites of the Corp of Forest Rangers.
label: Corpo forestale dello stato @it

Courier
type: Class
subclass of: Transfer service and renting
comment: Le istanze di questa classe rappresentano, tra tutte le attività d'impresa, talune attività postali e di corriere sulle quali non gravi un obbligo di servizio universale (un obbligo di legge posto a garanzia di un livello minimo del servizio che deve essere reso a tutta l'utenza interessata). @it
comment: The instances of this class represent, among all business activities, certain postal and courier activities on which no universal service obligation is involved (a statutory obligation to guarantee a minimum level of service to be rendered to all The affected user).
label: Corriere espresso @it

Credit collection agencies
type: Class
subclass of: Utilities and supply
comment: Le istanze di questa classe rappresentano, tra tutte le attività d'impresa, talune attività delle agenzie di recupero crediti. @it
comment: The instances of this class represent, among all business activities, certain activities of credit recovery agencies.
label: Agenzie recupero crediti @it

Crop Animal Production Hunting
type: Class
subclass of: Agriculture and livestock
comment: Le istanze di questa classe rappresentano, tra tutte le attività d'impresa, talune attività di produzione agricola, di trasformazione di prodotti animali, di caccia, ed altre attività connesse. @it
comment: The instances of this class represent, among all business activities, certain agricultural production activities, processing of animal products, hunting, and other related activities.
label: Produzione Animali, Vegetali e Caccia @it

Crop Production
type: Class
subclass of: Agriculture and livestock
comment: Le istanze di questa classe rappresentano, tra tutte le attività d'impresa, talune attività di coltivazione. @it
comment: The instances of this class represent, among all the business activities, certain cultivation activities.
label: Produzione Vegetali @it

Cultural Activity
type: Class
subclass of: Service
comment: Biblioteche, archivi, musei ed altre attività culturali. @it
comment: Libraries, archives, museums and other cultural activities.
label: Attivita' Culturale @it

Cultural and Recreation Goods
type: Class
subclass of: Shopping and service
comment: Le istanze di questa classe rappresentano, tra tutte le attività d'impresa, talune attività di commercio al dettaglio di articoli culturali e ricreativi in esercizi specializzati. @it
comment: The instances of this class represent, among all business activities, certain retail trade activities of cultural and recreational items in specialized stores.
label: Articoli Culturali e Ricreativi @it

Cultural centre
type: Class
subclass of: Cultural Activity
comment: Le istanze di questa classe rappresentano, tra tutte le sedi di servizi, taluni centri di attività culturale. @it
comment: The instances of this class represent, among all service locations, certain centers of cultural activity.
label: Centro culturale @it

Cultural education
type: Class
subclass of: EducationAndResearch
comment: Le istanze di questa classe rappresentano, tra tutte le attività d'impresa, taluni centri di formazione culturale. @it
comment: The instances of this class represent, among all business activities, some centers of cultural formation.
label: Formazione culturale @it

Cultural sites
type: Class
subclass of: Cultural Activity
comment: Le istanze di questa classe rappresentano, tra tutte le attività d'impresa, talune attività di biblioteche, archivi, musei ed altri luoghi di cultura. @it
comment: The instances of this class represent, among all business activities, certain activities of libraries, archives, museums and other places of culture.
label: Attivita' culturali @it

Curtains and Net Curtains
type: Class
subclass of: Shopping and service
comment: Le istanze di questa classe rappresentano, tra tutte le attività d'impresa, talune attività di commercio al dettaglio di tende e tendine. @it
comment: The instances of this class represent, among all business activities, certain retail and wholesale activities of curtains and curtains.
label: Tende e Tendine @it

Cycle paths
type: Class
subclass of: Transfer service and renting
comment: Le istanze di questa classe rappresentano, tra tutte le sedi di servizi, taluni percorsi ciclabili. @it
comment: The instances of this class represent, among all service locations, certain cycling routes.
label: Ciclopercorsi @it

Dairy products
type: Class
subclass of: Shopping and service
comment: Le istanze di questa classe rappresentano, tra tutte le attività d'impresa, talune attività di commercio al dettaglio di latte e di prodotti lattiero-caseari. @it
comment: The demands of this class represent, among all business activities, certain retail trade activities of milk and dairy products.
label: Latte e Latticini @it

Dance schools
type: Class
subclass of: EducationAndResearch
comment: Le istanze di questa classe rappresentano, tra tutte le attività d'impresa, talune attività di conduzione di corsi di danza. @it
comment: The instances of this class represent, among all the business activities, some activities of conducting dance classes.
label: Scuole di danza @it

Dating service
type: Class
subclass of: Shopping and service
comment: Le istanze di questa classe rappresentano, tra tutte le attività d'impresa, talune attività di agenzie matrimoniali e d'incontro. @it
comment: The instances of this class represent, among all the business activities, certain activities of marriage and meeting agencies.
label: Agenzie matrimoniali @it

Day care centre
type: Class
subclass of: Accommodation
comment: Le istanze di questa classe rappresentano, tra tutte le sedi di servizi, taluni centri di accoglienza. @it
comment: The instances of this class represent, among all service locations, some reception centers.
label: Centri accoglienza e case alloggio @it

Dentist
type: Class
subclass of: Health Care
comment: Le istanze di questa classe rappresentano, tra tutte le attività d'impresa, talune attività e servizi degli studi odontoiatrici. @it
comment: The instances of this class represent, among all the business activities, some activities and services of dental surgeries.
label: Dentista @it

Department of motor vehicles
type: Class
subclass of: Government Office
comment: Le istanze di questa classe rappresentano, tra tutte le sedi di servizi, talune sedi della Motorizzazione civile. @it
comment: The instances of this class represent, among all service locations, certain sites of Vehicle registration.
label: Motorizzazione civile @it

Device attribute
type: Class
subclass of: Restriction
  on property: Semantic label
  qualified cardinality: 1
  on class: Property
subclass of: Restriction
  on property: Disabled
  all values from: boolean
subclass of: Restriction
  on property: Data type
  qualified cardinality: 1
  on data range: string
subclass of: Restriction
  on property: Different values
  qualified cardinality: 1
  on data range: integer
subclass of: Restriction
  on property: Healthiness criteria
  qualified cardinality: 1
  on data range: string
subclass of: Restriction
  on property: Order (Position)
  qualified cardinality: 1
  on data range: integer
subclass of: Restriction
  on property: Value bounds
  qualified cardinality: 1
  on data range: string
subclass of: Restriction
  on property: Attribute name
  qualified cardinality: 1
  on data range: string
subclass of: Restriction
  on property: Value refresh rate
  qualified cardinality: 1
  on data range: integer
subclass of: Restriction
  on property: Unit of measure
  qualified cardinality: 1
  on data range: string
comment: Attribute of an Internet of Things device (sensor, or actuator). It represents something that the device is able to detect.
comment: Attributo di un dispositivo Internet Of Things, sensore o attuatore. Rappresenta una grandezza che il dispositivo è in grado di misurare. @it
label: Attributo del dispositivo @it

Diet Products
type: Class
subclass of: Shopping and service
comment: Le istanze di questa classe rappresentano, tra tutte le attività d'impresa, talune attività di commercio al dettaglio di prodotti macrobiotici e dietetici. @it
comment: The instances of this class represent, among all the business activities, some retail activities of macrobiotic and dietary products.
label: Prodotti Dietetici @it

Digital Location
type: Class
subclass of: Service
comment: Services classified by the city of Florence as Digital Location.
comment: Servizi classificati dal comune di Firenze come Digital Location. @it

Digital signage
type: Class
subclass of: Tourism Services
label: Segnaletica digitale @it

Dining hall
type: Class
subclass of: Wine And Food
comment: Le istanze di questa classe rappresentano, tra tutte le sedi di servizi, talune mense, anche non strutturate in forma di impresa. @it
comment: The instances of this class represent, among all service locations, certain canteens, not even structured in the form of a business.
label: Mense @it

Disabled parking area
type: Class
subclass of: Transfer service and renting
comment: Ciascuna istanza di questa classe rappresenta un'area di sosta riservata alle persone con ridotte capacità motorie. @it
comment: Each instance of this class represents a parking area reserved for people with reduced mobility.
label: Zona sosta disabili @it

Discotheque
type: Class
subclass of: Entertainment
comment: Le istanze di questa classe rappresentano, tra tutte le attività d'impresa, talune attività di discoteche, sale da ballo, night-club e simili. @it
comment: The instances of this class represent, among all the business activities, some activities of discos, ballrooms, nightclubs and the like.
label: Discoteca @it

Discount
type: Class
subclass of: Shopping and service
comment: Le istanze di questa classe rappresentano, tra tutte le attività d'impresa, talune attività dei discount di alimentari. @it
comment: The instances of this class represent, among all business activities, some food discount activities.

Disinfecting and exterminating activities
type: Class
subclass of: Environment
comment: Le istanze di questa classe rappresentano, tra tutte le attività d'impresa, taluni servizi di disinfestazione. @it
comment: The instances of this class represent, among all the business activities, certain disinfestation services.
label: Pulizia e disinfestazione @it

District
type: Class
subclass of: Government Office
comment: Class whose instances are the various neighborhoods in which a city can be subdivided.
comment: Classe le cui istanze sono i vari quartieri in cui una città può essere suddivisa. @it
label: Quartiere @it

Diving school
type: Class
subclass of: EducationAndResearch
comment: Le istanze di questa classe rappresentano, tra tutte le sedi di servizi, talune scuole di immersioni. @it
comment: The instances of this class represent, among all service locations, some diving schools.
label: Scuola di sub @it

Doctor office
type: Class
subclass of: Health Care
comment: Le istanze di questa classe rappresentano, tra tutte le attività d'impresa, taluni servizi degli studi medici di medicina generale. @it
comment: The instances of this class represent, among all business activities, certain services of general medical practice.
label: Ambulatorio medico @it

Dog area
type: Class
subclass of: Entertainment
comment: Ciascuna istanza di questa classe rappresenta un'area riservata allo sgambamento dei cani. @it
comment: Each instance of this class represents an area reserved for dog breeding.
label: Area per cani @it

Door to Door
type: Class
subclass of: Shopping and service
comment: Le istanze di questa classe rappresentano, tra tutte le attività d'impresa, talune attività di commercio al dettaglio di prodotti vari, mediante l'intervento di un dimostratore o di un incaricato alla vendita (porta a porta). @it
comment: The instances of this class represent, among all the business activities, certain retail activities of various products, by the intervention of a demonstrator or a sales agent (door to door).
label: Vendita Porta a Porta @it

Drinking fountain
type: Class
subclass of: Wine And Food
comment: Le istanze di questa classe rappresentano, tra tutte le sedi di servizi, talune fontanelle di acqua potabile. @it
comment: The instances of this class represent, among all service locations, some drinking water fountains.
label: Fontanelle @it

Earthquake
type: Class
subclass of: Event
comment: Ciascuna istanza di questa classe rappresenta un terremoto che ha interessato il territorio coperto dal progetto Km4City. @it
comment: Each instance of this class represents an earthquake that affected the territory covered by the Km4City project.
label: Terremoto @it

EducationAndResearch
type: Class
subclass of: Service
comment: Services such as schools for all ages and training schools.
comment: Servizi quali scuole per ogni eta' e scuole di formazione. @it
label: Istruzione @it

Educational support activities
type: Class
subclass of: EducationAndResearch
comment: Le istanze di questa classe rappresentano, tra tutte le attività d'impresa, taluni servizi di istruzione e di supporto all'istruzione, compresi i servizi di consulenza e di orientamento scolastico. @it
comment: The instances of this class include, among all business activities, certain education and training services, including counseling and school counseling services.
label: Altri servizi all'istruzione @it

Emergency
type: Class
subclass of: Service
comment: Contiene tutte le classi relative ai servizi di emergenza. @it
comment: The parent of all emergency-related classes.
label: Emergenze @it

Emergency medical care
type: Class
subclass of: Emergency
comment: Le istanze di questa classe rappresentano, tra tutte le attività d'impresa, taluni servizi di emergenza sanitaria, delle banche del sangue, e altri. @it
comment: The instances of this class include, among all business activities, certain health emergency services, blood banks, and others.
label: Guardia medica @it

Emergency services
type: Class
subclass of: Emergency
comment: Le istanze di questa classe rappresentano, tra tutte le sedi di servizi, taluni servizi di soccorso stradale. @it
comment: The instances of this class represent, among all service locations, certain roadside assistance services.
label: Soccorso stradale @it

Employment exchange
type: Class
subclass of: Government Office
comment: Le istanze di questa classe rappresentano, tra tutte le sedi di servizi, taluni centri per l'impiego. @it
comment: The instances of this class represent, among all service locations, some employment centers.
label: Centro per l'impiego @it

Energy Supply
type: Class
subclass of: Utilities and supply
comment: Le istanze di questa classe rappresentano, tra tutte le attività d'impresa, talune attività di produzione, distribuzione, e commercio di energia elettrica e combustibili. @it
comment: The instances of this class represent, among all the business activities, certain activities of production, distribution, and trade in electricity and fuels.
label: Fornitura Produzione Energia @it

Engineering consulting
type: Class
subclass of: Civil and edil engineering
comment: Le istanze di questa classe rappresentano, tra tutte le attività d'impresa, talune attività degli studi di ingegneria. @it
comment: The instances of this class represent, among all the business activities, certain activities of engineering studies.
label: Studi di Ingegneria @it

Entertainment
type: Class
subclass of: Service
comment: Entertainment services for the citizen.
comment: Servizi per l'intrattenimento del cittadino. @it
label: Intrattenimento @it

Entity group
type: Class
subclass of: High level type
comment: Rappresenta un qualsiasi gruppo di entità. @it
comment: Rappresents any group of entities.
label: Gruppi di entità @it

Entry
type: Class
subclass of: SpatialThing
subclass of: Restriction
  on property: latitude
  max cardinality: 1
subclass of: Restriction
  on property: longitude
  max cardinality: 1
disjoint with: Street Number
comment: Classe le cui istanze sono i possibili ingressi ai numeri civici
label: Accesso @it

Entry Rule
type: Class
subclass of: Restriction
  on property: Access to element
  min qualified cardinality: 0
  on class: Road element
comment: Class whose instances are the rules of access to the different road elements.
comment: Classe le cui istanze sono le regole di accesso ai differenti elementi stradali. @it
label: Regola di Accesso @it

Environment
type: Class
subclass of: Service
comment: Environmentally friendly services.
comment: Servizi legati all'ambiente. @it
label: Ambiente @it

Equipment for events and shows rental
type: Class
subclass of: Utilities and supply
comment: Le istanze di questa classe rappresentano, tra tutte le attività d'impresa, talune attività di noleggio di strutture ed attrezzature per manifestazioni e spettacoli. @it
comment: The instances of this class represent, among all the business activities, some rental activities of facilities and equipment for events and shows.
label: Noleggio attrezzature per manifestazioni e spettacoli @it

Estate activities
type: Class
subclass of: Shopping and service
comment: Le istanze di questa classe rappresentano, tra tutte le attività d'impresa, talune attività di locazione, compravendita, gestione e amministrazione di immobili anche per conto terzi. @it
comment: The instances of this class represent, among all the business activities, certain leasing, sale, management and administration of real estate also for third parties.
label: Agenzia immobiliare @it

Event
type: Class
subclass of: Event
subclass of: SpatialThing
disjoint with: Service
comment: Eventi programmati dal comune di firenze e dintormi. @it
comment: Events scheduled by the city of Florence and dusk.
label: Evento @it

Extraction of natural gas
type: Class
subclass of: Utilities and supply
comment: Le istanze di questa classe rappresentano, tra tutte le attività d'impresa, talune attività di estrazione di gas naturale. @it
comment: The instances of this class represent, among all business activities, certain natural gas extraction activities.
label: Estrazione Gas Naturale @it

Extraction of salt
type: Class
subclass of: Mining and quarrying
comment: Le istanze di questa classe rappresentano, tra tutte le attività d'impresa, talune attività di estrazione di sale. @it
comment: The instances of this class represent, among all the business activities, some salt extraction activities.
label: Estrazione di sale @it

Family counselling
type: Class
subclass of: Health Care
comment: Le istanze di questa classe rappresentano, tra tutte le sedi di servizi, taluni consultori familiari. @it
comment: The instances of this class represent, among all service locations, some family counselors.
label: Consultori @it

Farm house
type: Class
subclass of: Accommodation
comment: Le istanze di questa classe rappresentano, tra tutte le attività d'impresa, talune attività di residenza turistica alberghiera. @it
comment: The cases of this class represent, among all the commercial activities, some activities of the hotel tourist residence.
label: Residenza turistica alberghiera @it

Fast charging station
type: Class
subclass of: Transfer service and renting
comment: Ciascuna istanza di questa classe rappresenta una colonnina di ricarica per veicoli elettrici. @it
comment: Each instance of this class represents a charging column for electric vehicles.
label: Colonnina di ricarica veloce @it

Ferry stop
type: Class
subclass of: Transfer service and renting
comment: Le istanze di questa classe rappresentano ciascuna un porto di attracco dei traghetti di linea. @it
comment: The instances of this class are each a liner ferry port.
label: Fermata traghetto @it

Financial Service
type: Class
subclass of: Service
comment: Banche, istituti monetari e altri servizi finanziari. @it
comment: Banks, monetary institutions and other financial services.
label: Servizio Finanziario @it

Financial institute
type: Class
subclass of: Financial Service
comment: Le istanze di questa classe rappresentano, tra tutte le attività d'impresa, taluni servizi finanziari. @it
comment: The instances of this class represent, among all business activities, certain financial services.
label: Istituto monetario @it

Fine Arts Articles
type: Class
subclass of: Shopping and service
comment: Le istanze di questa classe rappresentano, tra tutte le attività d'impresa, talune attività di commercio al dettaglio di articoli per le belle arti. @it
comment: The instances of this class represent, among all the business activities, certain retail activities of fine arts articles.
label: Articoli Belle Arti @it

Fire brigade
type: Class
subclass of: Emergency
comment: Le istanze di questa classe rappresentano, tra tutte le sedi di servizi, talune sedi dei Vigili del Fuoco. @it
comment: The instances of this class represent, among all service locations, certain fire brigades.
label: Vigili del fuoco @it

First aid
type: Class
subclass of: Emergency
comment: Le istanze di questa classe rappresentano, tra tutte le sedi di servizi, taluni posti di Pronto soccorso. @it
comment: The instances of this class represent, among all service locations, some places of First Aid.
label: Pronto soccorso @it

First Aid state
type: Class
comment: Ciascuna istanza di questa classe rappresenta un'istantanea di quante persone si trovano, in un determinato istante di tempo, all'interno di un determinato punto di Pronto Soccorso, in una certa condizione, suddivisi a seconda del codice di urgenza che è stato loro attribuito. Le possibili condizioni in cui una persona che è in Pronto Soccorso può trovarsi sono: con destinazione, in attesa, in visita, in osservazione temporanea. Alcune istanze riportano tuttavia il conteggio complessivo, senza tenere conto della condizione in cui le diverse persone si trovano. In questo caso, la proprietà firstAidState è valorizzata a “Totali”. @it
comment: Each instance of this class represents a snapshot of how many people are, at a certain point in time, within a certain point of First Aid, in a certain condition, subdivided according to the urgency code assigned to them . The possible conditions in which a person who is in First Aid may be: destination, waiting, visiting, temporary observation. However, some instances report the total count, without taking into account the condition in which the different people are. In this case, the firstAidState property is valorized to "Totali".
label: Situazione in Pronto Soccorso @it

Fish and Seafood
type: Class
subclass of: Shopping and service
comment: Le istanze di questa classe rappresentano, tra tutte le attività d'impresa, talune attività di commercio al dettaglio di pesci, crostacei e molluschi. @it
comment: The instances of this class represent, among all business activities, certain retail trade of fish, crustaceans and molluscs.
label: Pescherie @it

Fishing and Aquaculture
type: Class
subclass of: Agriculture and livestock
comment: Le istanze di questa classe rappresentano, tra tutte le attività d'impresa, talune attività di pesca e acquacoltura. @it
comment: The instances of this class represent, among all business activities, certain fishing and aquaculture activities.
label: Pesca e Acquicoltura @it

Fishing reserve
type: Class
subclass of: Entertainment
comment: Le istanze di questa classe rappresentano, tra tutte le sedi di servizi, talune riserve di pesca. @it
comment: The instances of this class represent, among all service locations, some fishing reserves.
label: Riserve di pesca @it

Flight Companies
type: Class
subclass of: Transfer service and renting
comment: Le istanze di questa classe rappresentano, tra tutte le attività d'impresa, talune attività di trasporto aereo di linea di passeggeri. @it
comment: The instances of this class represent, among all business activities, certain passenger liner air transport activities.
label: Compagnie di Volo @it

Floor
type: Class
equivalent class: Storey
subclass of: High level type
subclass of: CityObject
comment: Entity that rappresents a floor
comment: Entità che rappresenta un piano @it
label: Piano @it

Flower shop
type: Class
subclass of: Shopping and service
comment: Le istanze di questa classe rappresentano, tra tutte le attività d'impresa, talune attività di commercio al dettaglio di fiori e piante. @it
comment: The instances of this class represent, among all the business activities, certain flower retail activities.
label: Fioraio @it

Food and Ice Cream Truck
type: Class
subclass of: Wine And Food
comment: Le istanze di questa classe rappresentano, tra tutte le attività d'impresa, talune attività di gelateria, pasticceria e ristorazione ambulante. @it
comment: The instances of this class represent, among all the business activities, certain icecream, pastry and catering activities.
label: Ristorazione e Gelaterie Ambulanti @it

Food and Tobacconist
type: Class
subclass of: Shopping and service
comment: Le istanze di questa classe rappresentano, tra tutte le attività d'impresa, talune attività di commercio al dettaglio di taluni prodotti alimentari, bevande e tabacchi. @it
comment: The instances of this class represent, among all business activities, certain retail activities of certain foodstuffs, beverages and tobacco.
label: Alimentari e Tabaccherie @it

Food Manufacture
type: Class
subclass of: Industry and manufacturing
comment: Le istanze di questa classe rappresentano, tra tutte le attività d'impresa, talune attività di produzione industriale di alimenti. @it
comment: The instances of this class represent, among all business activities, certain industrial food production activities.
label: Produzione Alimentare @it

Food trade
type: Class
subclass of: Wine And Food
comment: Ciascuna istanza di questa classe rappresenta un'attività di rivendita di alimenti. @it
comment: Each instance of this class represents a food resale activity.
label: Rivendite di alimenti @it

Footwear and Accessories
type: Class
subclass of: Shopping and service
comment: Le istanze di questa classe rappresentano, tra tutte le attività d'impresa, talune attività di commercio al dettaglio di calzature e accessori.
comment: The instances of this class represent, among all business activities, certain retail trade activities of footwear and accessories.
label: Calzature @it

Footwear and Leather Goods
type: Class
subclass of: Shopping and service
comment: Le istanze di questa classe rappresentano, tra tutte le attività d'impresa, talune attività di commercio al dettaglio di calzature e articoli in pelle. @it
comment: The instances of this class represent, among all business activities, certain retail trade activities of footwear and leather goods.
label: Calzature e Articoli in Pelle @it

Footwear factory outlet
type: Class
subclass of: Shopping and service
comment: Le istanze di questa classe rappresentano, tra tutte le attività d'impresa, talune attività di vendita di calzature in spacci e outlet. @it
comment: The instances of this class represent, among all the business activities, certain activities of selling footwear in shops and outlets.
label: Spacci outlet calzature @it

Footwear Manufacture
type: Class
subclass of: Industry and manufacturing
comment: Le istanze di questa classe rappresentano, tra tutte le attività d'impresa, talune attività di produzione di calzature e parti in cuoio delle calzature. @it
comment: The instances of this class represent, among all the business activities, certain footwear manufacturing and leather footwear manufacturing activities.
label: Produzione Calzature @it

Forest
type: Class
subclass of: Entertainment
comment: Ciascuna istanza di questa classe rappresenta una foresta. @it
comment: Each instance of this class represents a forest.
label: Foresta @it

Forestry
type: Class
subclass of: Environment
comment: Le istanze di questa classe rappresentano, tra tutte le attività d'impresa, talune attività di silvicoltura ed utilizzo di aree forestali. @it
comment: The instances of this class represent, among all the business activities, certain forestry activities and use of forest areas.
label: Silvicoltura @it

Freight Transport and Furniture Removal
type: Class
subclass of: Transfer service and renting
comment: Le istanze di questa classe rappresentano, tra tutte le attività d'impresa, taluni servizi di trasloco e di trasporto merci su strada. @it
comment: The instances of this class represent, among all business activities, certain removal and cargo transport services on the road.
label: Trasporto Merci e Traslochi @it

Fresh place
type: Class
subclass of: Tourism Services
comment: Luoghi in cui e' possibile sedere all'aria condizionata durante l'estate
comment: Places where you can sit in air conditioning during the summer.
label: Luoghi freschi @it

Frozen Food
type: Class
subclass of: Shopping and service
comment: Le istanze di questa classe rappresentano, tra tutte le attività d'impresa, talune attività di commercio al dettaglio di prodotti surgelati. @it
comment: The instances of this class represent, among all business activities, certain retail trade activities of frozen products.
label: Vendita Surgelati @it

Fruit and Vegetables
type: Class
subclass of: Shopping and service
comment: Le istanze di questa classe rappresentano, tra tutte le attività d'impresa, talune attività di commercio al dettaglio di frutta e verdura. @it
comment: The instances of this class represent, among all business activities, certain fruit and vegetable retail activities.
label: Frutta e Verdura @it

Fuel station observation
type: Class
subclass of: Observation
comment: Ciascuna istanza di questa classe rappresenta una rilevazione dello stato di un distributore di carburanti in un determinato istante. @it
comment: Each instance of this class represents a state of a fuel distributor at a given instant.
label: Rilevazione su distributore di carburanti @it

Fuel station
type: Class
subclass of: Transfer service and renting
comment: Le istanze di questa classe rappresentano, tra tutte le attività d'impresa, talune attività di commercio al dettaglio di carburante per autotrazione. @it
comment: The instances of this class represent, among all business activities, certain retail trade activities of automotive fuel.
label: Distributore di carburante @it

Funeral
type: Class
subclass of: Shopping and service
comment: Le istanze di questa classe rappresentano, tra tutte le attività d'impresa, talune attività di pompe funebri e servizi connessi. @it
comment: The instances of this class represent, among all the business activities, some funeral activities and related services.
label: Pompe funebri @it

Funeral and Cemetery Articles
type: Class
subclass of: Shopping and service
comment: Le istanze di questa classe rappresentano, tra tutte le attività d'impresa, talune attività di commercio al dettaglio di articoli funerari e cimiteriali. @it
comment: The instances of this class represent, among all business activities, certain retail trade activities of funerary and cemeteries.
label: Articoli Funerari e Cimiteriali @it

Fur and Leather Clothing
type: Class
subclass of: Shopping and service
comment: Le istanze di questa classe rappresentano, tra tutte le attività d'impresa, talune attività di commercio al dettaglio di pellicce e di abbigliamento in pelle. @it
comment: The instances of this class represent, among all the business activities, certain activities of retail trade of fur and leather clothing.
label: Pellicce Abbigliamento Pelle @it

Gambling and betting
type: Class
subclass of: Entertainment
comment: Le istanze di questa classe rappresentano, tra tutte le attività d'impresa, talune attività connesse alle lotterie, alle scommesse, e alle sale da gioco. @it
comment: The instances of this class represent, among all business activities, certain activities related to lotteries, betting, and gambling halls.
label: Lotterie e scommesse @it

Game reserve
type: Class
subclass of: Entertainment
comment: Le istanze di questa classe rappresentano, tra tutte le sedi di servizi, taluni parchi naturali. @it
comment: The instances of this class represent, amongst all service locations, some natural parks.
label: Parco naturale @it

Game room
type: Class
subclass of: Entertainment
comment: Le istanze di questa classe rappresentano, tra tutte le attività d'impresa, talune attività di sale giochi e biliardi. @it
comment: The instances of this class represent, among all the business activities, certain activities of playing rooms and billiards.
label: Ludoteca e biliardi @it

Games and toys
type: Class
subclass of: Shopping and service
comment: Le istanze di questa classe rappresentano, tra tutte le attività d'impresa, talune attività di commercio al dettaglio di giochi e giocattoli (inclusi quelli elettronici). @it
comment: The instances of this class represent, among all business activities, certain retail activities of games and toys (including electronic ones).
label: Giochi e Giocattoli @it

Garden and Agriculture
type: Class
subclass of: Shopping and service
comment: Le istanze di questa classe rappresentano, tra tutte le attività d'impresa, talune attività di commercio al dettaglio di macchine, attrezzature e prodotti per l'agricoltura e il giardinaggio. @it
comment: The instances of this class represent, among all business activities, certain retail trade activities of machinery, equipment and products for agriculture and gardening.
label: Giardinaggio e Agricultura @it

Gardens
type: Class
subclass of: Entertainment
comment: Le istanze di questa classe rappresentano, tra tutte le sedi di servizi, taluni parchi e giardini. @it
comment: The instances of this class represent, among all service locations, some parks and gardens.
label: Giardini @it

Geologists
type: Class
subclass of: Environment
comment: Le istanze di questa classe rappresentano, tra tutte le attività d'impresa, talune attività di studio geologico e di prospezione geognostica e mineraria. @it
comment: The instances of this class represent, among all business activities, certain geological and geo-survey and mining research activities.
label: Geologi @it

Gifts and Smoking Articles
type: Class
subclass of: Shopping and service
comment: Le istanze di questa classe rappresentano, tra tutte le attività d'impresa, talune attività di commercio al dettaglio di articoli da regalo e per fumatori. @it
comment: The instances of this class represent, among all the business activities, certain activities of retail trade of gift items and smokers.
label: Articoli da Regalo e per Fumatori @it

Golf
type: Class
subclass of: Entertainment
comment: Le istanze di questa classe rappresentano, tra tutte le sedi di servizi, taluni campi da golf. @it
comment: The instances of this class represent, among all service locations, some golf courses.

Goods Yard
type: Class
subclass of: StopPoint
subclass of: SpatialThing
subclass of: Restriction
  on property: Correspond to junction
  qualified cardinality: 1
  on class: Railway Junction
comment: Goods Scale, are located at railway junctions with 1:1 ratio.
comment: Scalo Merci, sono posizionati in corrispondenza di giunzioni ferroviarie con relazione 1:1 @it
label: Scalo Merci @it

Government Office
type: Class
subclass of: Service
comment: Government offices open to the public.
comment: Uffici governativi aperti al pubblico. @it
label: Uffici Pubblici @it

Green areas
type: Class
subclass of: Entertainment
comment: Le istanze di questa classe rappresentano, tra tutte le sedi di servizi, talune aree verdi. @it
comment: The instances of this class represent, among all service locations, some green areas.
label: Aree verdi @it

Grill
type: Class
subclass of: Wine And Food
comment: Ciascuna istanza di questa classe rappresenta una rosticceria. @it
comment: Each instance of this class represents a rotisserie.
label: Rosticceria @it

Group practice
type: Class
subclass of: Health Care
comment: Ciascuna istanza di questa classe rappresenta un poliambulatorio. @it
comment: Each instance of this class represents an health centre.
label: Poliambulatorio @it

Gym fitness
type: Class
subclass of: Entertainment
comment: Le istanze di questa classe rappresentano, tra tutte le attività d'impresa, talune attività di gestione di palestre. @it
comment: The instances of this class represent, among all the business activities, some gym management activities.
label: Palestra fitness @it

Haberdashery
type: Class
subclass of: Shopping and service
comment: Le istanze di questa classe rappresentano, tra tutte le attività d'impresa, talune attività di commercio al dettaglio di filati per maglieria e merceria. @it
comment: The instances of this class represent, among all the business activities, certain retail trade activities of knitting and knitting yarns.
label: Merceria, filati @it

Haircare centres
type: Class
subclass of: Health Care
comment: Le istanze di questo classe rappresentano, tra tutte le attività di impresa, alcune attività di ambulatori tricologici. @it
comment: The instances of this class represent, among all business activities, certain activities of trichological surgeries.
label: Centri tricologici @it

Hairdressing
type: Class
subclass of: Shopping and service
comment: Le istanze di questa classe rappresentano, tra tutte le attività d'impresa, taluni servizi dei saloni di barbiere e parrucchiere. @it
comment: The demands of this class represent, among all the business activities, certain services of barber and hairdresser salons.
label: Barbieri e parrucchiere @it

Hairdressing and beauty treatment
type: Class
subclass of: Shopping and service
comment: Le istanze di questa classe rappresentano, tra tutte le attività d'impresa, taluni servizi degli acconciatori, manicure, pedicure e trattamenti estetici. @it
comment: The instances of this class represent, among all the business activities, certain services of hairdressers, manicures, pedicures and aesthetic treatments.
label: Parrucchieri e trattamenti di bellezza @it

Hamlet
type: Class
subclass of: SpatialThing
comment: Le istanze di questa classe rappresentano ciascuna una frazione o un quartiere. @it
comment: The instances of this class represent each an hamlet or a district.
label: Frazione @it

Hardware Electrical Plumbing and Heating
type: Class
subclass of: Shopping and service
comment: Le istanze di questa classe rappresentano, tra tutte le attività d'impresa, talune attività di commercio al dettaglio di ferramenta, vernici, vetro piano e materiale elettrico e termoidraulico. @it
comment: The instances of this class represent, among all business activities, certain retail trade of hardware, paints, flat glass and electrical and plumbing plumbing.
label: Ferramenta Elettricita' Termoidraulica @it

Hardware Paints and Glass
type: Class
subclass of: Shopping and service
comment: Le istanze di questa classe rappresentano, tra tutte le attività d'impresa, talune attività di commercio al dettaglio di ferramenta, vernici, vetro piano e materiali da costruzione. @it
comment: The instances of this class represent, among all the business activities, certain retail trade of hardware, paints, flat glass and building materials.
label: Ferramenta Vernici Vetro @it

Health Care
type: Class
subclass of: Service
comment: Hospitals, medical studios, analysis laboratories and other facilities providing health services.
comment: Ospedali, studi medici, laboratori analisi e altre strutture che forniscono servizi sanitari. @it
label: Assistenza Sanitaria @it

Health district
type: Class
subclass of: Health Care
comment: Le istanze di questa classe rappresentano, tra tutte le sedi di servizi, taluni distretti sanitari. @it
comment: The instances of this class represent, among all service locations, certain health districts.
label: Distretto sanitario @it

Health reservations centre
type: Class
subclass of: Health Care
comment: Le istanze di questa classe rappresentano, tra tutte le sedi di servizi, taluni centri unici di prenotazione istituiti presso i distretti sanitari. @it
comment: The instances of this class represent, among all service locations, certain single reservation centers established at health districts.
label: Centro unico di prenotazione @it

Healthcare centre
type: Class
subclass of: Health Care
comment: Le istanze di questa classe rappresentano, tra tutte le sedi di servizi, taluni centri di assistenza sanitaria istituiti presso i distretti sanitari. @it
comment: The instances of this class represent, among all service locations, certain health care centers established at health districts.
label: Centri assistenza @it

Rappresentation of data in the form of map
type: Class
subclass of: High level type
comment: Rappresentazione di dati di multipli tipologie in forma di mappa secondo una scala colore. @it
comment: Representation of multiple kind of data in the form of a map according to a color map.
label: Rappresentazione di dati in forma di mappa @it

Helipads
type: Class
subclass of: Transfer service and renting
comment: Le istanze di questa classe rappresentano, tra tutte le sedi di servizi, talune elisuperfici. @it
comment: The instances of this class represent, among all service locations, some hills.
label: Elisuperfici @it

Herbalist's Shop
type: Class
subclass of: Shopping and service
comment: Le istanze di questa classe rappresentano, tra tutte le attività d'impresa, talune erboristerie. @it
comment: The instances of this class represent, among all the business activities, some herbalists.
label: Erboristerie @it

High level type
type: Class
subclass of: Service
comment: Entities describing complex elemtents in the urban environment or results of computations of raw data in higher level representation
comment: Entità che descrivono elementi complessi dell'ambiente urbano o risultati di elaborazioni di dati grezzi in rappresentazioni di più alto livello @it
label: Tipo alto livello @it

Higher education
type: Class
subclass of: EducationAndResearch
comment: Le istanze di questa classe rappresentano, tra tutte le attività d'impresa, taluni centri di formazione post-secondaria universitaria e non universitaria. @it
comment: The instances of this class represent, among all business activities, some university and non-university post-secondary training centers.
label: Universita' @it

Highway stop
type: Class
subclass of: Wine And Food
comment: Le istanze di questa classe rappresentano, tra tutte le attività d'impresa, talune aree di servizio lungo le principali arterie viarie. @it
comment: The instances of this class represent, among all business activities, certain service areas along the main road arteries.
label: Autogrill @it

Hippodrome
type: Class
subclass of: Entertainment
comment: Le istanze di questa classe rappresentano, tra tutte le sedi di servizi, taluni ippodromi. @it
comment: The instances of this class represent, among all service locations, some racecourses.
label: Ippodromo @it

Historic residence
type: Class
subclass of: Accommodation
comment: Le istanze di questa classe rappresentano, tra tutte le sedi di servizi, talune residenze storiche che offrono un servizio di alloggio. @it
comment: The instances of this class represent, among all service locations, some historic residences that offer accommodation services.
label: Residenze epoca @it

Historical buildings
type: Class
subclass of: Cultural Activity
comment: Le istanze di questa classe rappresentano, tra tutte le sedi di servizi, taluni palazzi storici. @it
comment: The instances of this class represent, among all the service venues, some historic buildings.
label: Palazzi @it

Holiday village
type: Class
subclass of: Accommodation
comment: Le istanze di questa classe rappresentano, tra tutte le attività d'impresa, taluni alloggi per le vacanze e altre strutture per brevi soggiorni, compresi i villaggi turistici. @it
comment: The instances of this class represent, among all business activities, some holiday accommodation and other short-term accommodation, including resorts.
label: Villaggio vacanze @it

Hostel
type: Class
subclass of: Accommodation
comment: Le istanze di questa classe rappresentano, tra tutte le attività d'impresa, taluni ostelli per la gioventù. @it
comment: The instances of this class represent, among all business activities, some youth hostels.
label: Ostello @it

Hotel
type: Class
subclass of: Accommodation
comment: Le istanze di questa classe rappresentano, tra tutte le attività d'impresa, taluni alberghi e strutture simili. @it
comment: The instances of this class represent, among all business activities, certain hotels and similar structures.
label: Albergo hotel @it

Household appliances shop
type: Class
subclass of: Shopping and service
comment: Le istanze di questa classe rappresentano, tra tutte le attività d'impresa, talune attività di commercio al dettaglio di elettrodomestici in esercizi specializzati. @it
comment: The instances of this class represent, among all business activities, some retail trade of household appliances in specialized stores.
label: Vendita e riparazione elettrodomestici @it

Household Articles
type: Class
subclass of: Shopping and service
comment: Le istanze di questa classe rappresentano, tra tutte le attività d'impresa, talune attività di commercio al dettaglio di taluni articoli per la casa. @it
comment: The instances of this class represent, among all business activities, certain retail activities of certain household items.
label: Articoli per la Casa @it

Household Fuel
type: Class
subclass of: Shopping and service
comment: Le istanze di questa classe rappresentano, tra tutte le attività d'impresa, talune attività di commercio al dettaglio di combustibile per uso domestico e per riscaldamento. @it
comment: The instances of this class represent, among all business activities, certain retail trade activities of domestic and heating fuel.
label: Combustibile Uso Domestico @it

Household Furniture
type: Class
subclass of: Shopping and service
comment: Le istanze di questa classe rappresentano, tra tutte le attività d'impresa, talune attività di commercio al dettaglio di mobili per la casa. @it
comment: The instances of this class represent, among all the business activities, some retail business of home furniture.
label: Mobili per la Casa @it

Household Products
type: Class
subclass of: Shopping and service
comment: Le istanze di questa classe rappresentano, tra tutte le attività d'impresa, talune attività di commercio al dettaglio di taluni prodotti per uso domestico in esercizi specializzati. @it
comment: The instances of this class represent, among all business activities, certain retail activities of certain domestic products in specialized stores.
label: Prodotti Uso Domestico @it

Household Utensils
type: Class
subclass of: Shopping and service
comment: Le istanze di questa classe rappresentano, tra tutte le attività d'impresa, talune attività di commercio al dettaglio di utensili per la casa, di cristallerie e vasellame. @it
comment: The instances of this class represent, among all business activities, certain retail trade activities of household utensils, glassware and pottery.
label: Prodotti per la Casa @it

Human health activities
type: Class
subclass of: Health Care
comment: Le istanze di questa classe rappresentano, tra tutte le attività d'impresa, talune attività di assistenza sanitaria. @it
comment: The instances of this class represent, among all business activities, certain health care activities.
label: Assistenza Sanitaria @it

Hunting Trapping and Services
type: Class
subclass of: Agriculture and livestock
comment: Le istanze di questa classe rappresentano, tra tutte le attività d'impresa, talune attività di caccia, cattura di animali e servizi connessi. @it
comment: The instances of this class represent, among all business activities, some hunting, animal trapping and related services.
label: Caccia Cattura e Servizi @it

Hydrometry observation
type: Class
subclass of: Observation
comment: Ciascuna istanza di questa classe rappresenta una rilevazione idrometrica. @it
comment: Each instance of this class represents a hydrometric detection.
label: Osservazione idrometrica @it

Hygrometry observation
type: Class
subclass of: Observation
comment: Ciascuna istanza di questa classe rappresenta una rilevazione igrometrica. @it
comment: Each instance of this class represents a hygrometric detection.
label: Osservazione igrometrica @it

Hypermarket
type: Class
subclass of: Shopping and service
comment: Le istanze di questa classe rappresentano, tra tutte le attività d'impresa, taluni ipermercati. @it
comment: The instances of this class represent, among all business activities, some hypermarkets.
label: Ipermercati @it

Air Quality Criticality Index agglomeration
type: Class
comment: Ciascuna istanza di questa classe rappresenta un agglomerato (area geografica opportunamente delimitata) definito ai fini del monitoraggio della qualità dell'aria attraverso l'indice ICQA, Indice di Criticità per la Qualità dell'aria, introdotto dalla Regione Toscana nell'agosto del 2016. @it
comment: Each instance of this class represents an agglomeration (suitably delimited geographical area) defined for air quality monitoring through the ICQA index, introduced by the Tuscany Region, Italy, in August 2016.
label: Agglomerato ICQA @it

ICQA Observation
type: Class
subclass of: Observation
comment: Ciascuna istanza di questa classe rappresenta una rilevazione della qualità dell'aria su di un agglomerato. @it
comment: Each instance of this class represents an air quality detection on an agglomeration.
label: Rilevazione ICQA @it

Ice cream parlour
type: Class
subclass of: Wine And Food
comment: Le istanze di questa classe rappresentano, tra tutte le attività d'impresa, talune gelaterie e pasticcerie. @it
comment: The instances of this class represent, among all business activities, some ice cream parlors and pastry shops.
label: Gelateria @it

ICT service
type: Class
subclass of: Industry and manufacturing
comment: Le istanze di questa classe rappresentano, tra tutte le attività d'impresa, talune attività di elaborazione dati, hosting e attività connesse, portali Web, e altre attività dei servizi dell'informazione. @it
comment: The instances of this class represent, among all business activities, certain data processing, hosting and related activities, web portals, and other information service activities.
label: Servizi ICT @it

Income revenue authority
type: Class
subclass of: Government Office
comment: Le istanze di questa classe rappresentano, tra tutte le sedi di servizi, talune sedi dell'Agenzia delle Entrate. @it
comment: The instances of this class represent, among all service locations, certain offices of the Revenue Agency.
label: Agenzia delle entrate @it

industrial laundries
type: Class
subclass of: Shopping and service
comment: Le istanze di questa classe rappresentano, tra tutte le attività d'impresa, talune attività delle lavanderie industriali. @it
comment: The instances of this class represent, among all the business activities, certain activities of industrial laundries.
label: Lavanderie industriali @it

Industry and manufacturing
type: Class
subclass of: Service
comment: Services related to industry and work.
comment: Servizi legati all'industria e al lavoro. @it
label: Industria e produzione @it

Installation of Industrial Machinery
type: Class
subclass of: Industry and manufacturing
comment: Le istanze di questa classe rappresentano, tra tutte le attività d'impresa, talune attività di installazione di apparecchiature ad uso industriale e medicale, quali in particolare: installazione di apparecchi elettrici ed elettronici per telecomunicazioni, di apparecchi trasmittenti radiotelevisivi, di impianti di apparecchiature elettriche ed elettroniche (esclusa l'installazione all'interno degli edifici); installazione di strumenti ed apparecchi di misurazione, controllo, prova, navigazione e simili (incluse le apparecchiature di controllo dei processi industriali); installazione di macchine per ufficio, di mainframe e computer simili; installazione di altre macchine ed apparecchiature industriali; installazione di motori, generatori e trasformatori elettrici, di apparecchiature per la distribuzione e il controllo dell'elettricità (esclusa l'installazione all'interno degli edifici); installazione di apparecchi medicali, di apparecchi e strumenti per odontoiatria; installazione di motori, generatori e trasformatori elettrici, di apparecchiature per la distribuzione e il controllo dell'elettricità (esclusa l'installazione all'interno degli edifici). @it
comment: The instances of this class represent, among all the business activities, certain activities for the installation of industrial and medical equipment, such as: installation of electrical and electronic equipment for telecommunications and radio transmitting equipment; installation of instruments, apparatus for measuring, checking, testing, navigation and the like; installation of office machines, mainframes and similar computers; installation of other machines and industrial equipments; installation of motors, generators and transformers, electricity distribution and control equipment; installation of medical devices; installation of appliances and instruments for odontology; installation of motors, generators and transformers, electrical distribution and control equipment.
label: Installazione Macchinari Industriali @it

Insurance
type: Class
subclass of: Financial Service
comment: Le istanze di questa classe rappresentano, tra tutte le attività d'impresa, talune attività di assicurazioni, agenti, sub-agenti, broker e altri intermediari, anche ai fini dell'apertura di fondi pensione e di assicurazioni sulla vita. @it
comment: The instances of this class include, among all business activities, certain insurance, agents, sub agents, brokers and other intermediaries, including for the purpose of opening pension funds and life insurance.
label: Assicurazione @it

Insurance and financial
type: Class
subclass of: Financial Service
comment: Le istanze di questa classe rappresentano, tra tutte le attività d'impresa, talune attività ausiliarie dei servizi finanziari e delle attività assicurative. @it
comment: The instances of this class represent, among all business activities, some auxiliary activities in financial services and insurance activities.
label: Assicurazione e finanziario @it

Internet Point and Public Telephone
type: Class
subclass of: Utilities and supply
comment: Le istanze di questa classe rappresentano, tra tutte le attività d'impresa, talune attività dei posti telefonici pubblici e degli Internet Point. @it
comment: The instances of this class represent, among all business activities, certain activities of public telephone and Internet Point.
label: Internet Point @it

Internet Service Provider
type: Class
subclass of: Utilities and supply
comment: Le istanze di questa classe rappresentano, tra tutte le attività d'impresa, talune attività di erogazione di servizi di accesso ad Internet. @it
comment: The instances of this class represent, among all business activities, certain Internet access services.
label: Servizi di accesso ad internet @it

Investigation activities
type: Class
subclass of: Utilities and supply
comment: Le istanze di questa classe rappresentano, tra tutte le attività d'impresa, taluni servizi investigativi privati. @it
comment: The instances of this class represent, among all business activities, certain private investigation services.
label: Servizi investigativi privati @it

Actuator
type: Class
subclass of: IoT Device
subclass of: Service
subclass of: Actuator
subclass of: Restriction
  on property: Attributes status
  all values from: string
subclass of: Restriction
  on property: Format
  all values from: string
subclass of: Restriction
  on property: MAC address
  all values from: string
subclass of: Restriction
  on property: Model
  all values from: string
subclass of: Restriction
  on property: Producer
  all values from: string
subclass of: Restriction
  on property: Properties status
  all values from: string
subclass of: Restriction
  on property: Protocol
  all values from: string
subclass of: Restriction
  on property: hasSystemCapability
  all values from: SystemCapability
subclass of: Restriction
  on property: observes
  min qualified cardinality: 1
  on class: Property
subclass of: Restriction
  on property: Has attribute
  min qualified cardinality: 1
  on class: Device attribute
subclass of: Restriction
  on property: exposedBy
  qualified cardinality: 1
  on class: Message Broker
subclass of: Restriction
  on property: implements
  qualified cardinality: 1
  on class: Procedure
subclass of: Restriction
  on property: Creation datetime
  all values from: dateTime
comment: Le istanze di questa classe rappresentano ciascuna un attuatore. @it
comment: The instances of this class represent each an actuator.
label: Attuatore @it

Message Broker
type: Class
subclass of: Service
subclass of: Restriction
  on property: Password
  all values from: string
subclass of: Restriction
  on property: Username
  all values from: string
subclass of: Restriction
  on property: Creation datetime
  all values from: dateTime
subclass of: Restriction
  on property: endpoint
  min qualified cardinality: 1
  on data range: string
comment: It represents a hardware/software component that acts as an interface between a device or a set of devices (sensors, actuators) and the external.
comment: Modella un componente hardware/software che agisce da interfaccia tra un dispositivo o un insieme di dispositivi (sensori, attuatori) e il mondo esterno. @it
label: Broker @it

IoT Device
type: Class
subclass of: Service
label: Dispositivo IoT @it

Sensor
type: Class
subclass of: IoT Device
subclass of: Service
subclass of: Sensor
subclass of: Restriction
  on property: Attributes status
  all values from: string
subclass of: Restriction
  on property: Format
  all values from: string
subclass of: Restriction
  on property: MAC address
  all values from: string
subclass of: Restriction
  on property: Model
  all values from: string
subclass of: Restriction
  on property: Producer
  all values from: string
subclass of: Restriction
  on property: Properties status
  all values from: string
subclass of: Restriction
  on property: Protocol
  all values from: string
subclass of: Restriction
  on property: hasSystemCapability
  all values from: SystemCapability
subclass of: Restriction
  on property: observes
  min qualified cardinality: 1
  on class: Property
subclass of: Restriction
  on property: Has attribute
  min qualified cardinality: 1
  on class: Device attribute
subclass of: Restriction
  on property: exposedBy
  qualified cardinality: 1
  on class: Message Broker
subclass of: Restriction
  on property: implements
  qualified cardinality: 1
  on class: Procedure
subclass of: Restriction
  on property: Creation datetime
  all values from: dateTime
comment: Le istanze di questa classe rappresentano ciascuna un sensore. @it
comment: The instances of this class represent each a sensor.
label: Sensore @it

Irrigator
type: Class
subclass of: Environment
comment: Ciascuna istanza di questa classe rappresenta un irrigatore. @it
comment: Each instance of this class represents an irrigator.
label: Irrigatore @it

Italian finance police
type: Class
subclass of: Emergency
comment: Le istanze di questa classe rappresentano, tra tutte le sedi di servizi, talune sedi della Guardia di Finanza. @it
comment: The instances of this class represent, among all service locations, certain offices of the Italian financial police.
label: Guardia di finanza @it

Jeweller
type: Class
subclass of: Shopping and service
comment: Le istanze di questa classe rappresentano, tra tutte le attività d'impresa, talune attività di riparazione di orologi e gioielli. @it
comment: The instances of this class represent, among all the business activities, certain remaking of watches and jewelery.
label: Riparazione orologi e gioielli @it

Jewellery
type: Class
subclass of: Shopping and service
comment: Le istanze di questa classe rappresentano, tra tutte le attività d'impresa, talune attività di commercio al dettaglio di orologi, articoli di gioielleria e argenteria. @it
comment: The instances of this class represent, among all business activities, certain retail activities of watches, jewelery and silverware.
label: Gioielleria @it

Journalist
type: Class
subclass of: Cultural Activity
comment: Le istanze di questa classe rappresentano, tra tutte le attività d'impresa, talune attività dei giornalisti indipendenti. @it
comment: The instances of this class represent, among all the business activities, certain activities of independent journalists.
label: Giornalisti indipendenti @it

Junction
type: Class
subclass of: Node
subclass of: SpatialThing
comment: An interconnection point between road segments to draw a RoadElement.
comment: Punto di interconnessione tra segmenti di strada per disegnare un RoadElement. @it
label: giunzione stradale @it

Knitted Manufacture
type: Class
subclass of: Industry and manufacturing
comment: Le istanze di questa classe rappresentano, tra tutte le attività d'impresa, talune attività di produzione di maglieria, calzetteria in maglia, pullover, cardigan, ed altri articoli simili a maglia. @it
comment: The instances of this class represent, among all the business activities, certain knitting, knitwear, jerseys, cardigans and other knitwear items.
label: Produzione a Maglia @it

Labour consultant
type: Class
subclass of: Financial Service
comment: Le istanze di questa classe rappresentano, tra tutte le attività d'impresa, talune attività dei consulenti del lavoro. @it
comment: The instances of this class represent, among all the business activities, certain activities of job counselors.
label: Consulenti del lavoro @it

Land Transport
type: Class
subclass of: Transfer service and renting
comment: Le istanze di questa classe rappresentano, tra tutte le attività d'impresa, talune attività di trasporto terrestre di passeggeri, ed in particolare: trasporto con taxi, noleggio di autovetture con conducente; trasporto terrestre di passeggeri in aree urbane e suburbane; trasporto terrestre e trasporto mediante condotte; altre attività di trasporto terrestre di passeggeri. @it
comment: The instances of this class represent, among all business activities, certain terrestrial passenger transport activities, and in particular: taxi transport, car hire with driver; terrestrial passenger transport in urban and suburban areas; terrestrial transport and transport by means of pipelines; other terrestrial passenger transport activities.
label: Trasporti Terrestri @it

Land-transport rental
type: Class
subclass of: Transfer service and renting
comment: Le istanze di questa classe rappresentano, tra tutte le attività d'impresa, talune attività di noleggio di taluni mezzi di trasporto terrestri. @it
comment: The instances of this class represent, among all business activities, certain rental activities of certain land transport vehicles.
label: Noleggio altri mezzi trasporto terrestri @it

Landscape care
type: Class
subclass of: Environment
comment: Le istanze di questa classe rappresentano, tra tutte le attività d'impresa, talune attività di cura e manutenzione del paesaggio (inclusi parchi, giardini e aiuole). @it
comment: The instances of this class represent, among all business activities, some landscape care and maintenance activities (including parks, gardens and flowerbeds).
label: Cura del paesaggio @it

Lane
type: Class
comment: Le istanze di questa classe rappresentano restrizioni attive su di una specifica corsia tracciata sull'asfalto. @it
comment: The instances of this class represent each a set of restrictions that apply to a specific lane.
label: Corsia @it

Lanes
type: Class
comment: Le istanze di questa classe rappresentano un insieme di corsie tracciate sulla sede stradale. @it
comment: The instances of this class represent each a lane drawed on the asphalt.
label: Corsie @it

Lanes count
type: Class
comment: Le istanze di questa classe rappresentano il conteggio delle corsie presenti in un certo insieme di corsie rappresentato dalla classe Lanes, eseguito separatamente per le corsie riservate a particolari utilizzi e per quelle disponibili per tutti i generi di veicoli. @it
comment: The instances of this class represent each the count of the lanes that belong to a specific set of lanes represented through an instance of the class Lanes, with separate indication of the lanes that are designated to particular usages.
label: Conta delle corsie @it

Language courses
type: Class
subclass of: EducationAndResearch
comment: Le istanze di questa classe rappresentano, tra tutte le attività d'impresa, talune attività dei corsi di lingua da chiunque organizzati, e delle scuole di lingua. @it
comment: The instances of this class represent, among all business activities, some activities of language courses by anyone organized, and language schools.
label: Corsi di lingue @it

laundries and dry cleaners
type: Class
subclass of: Shopping and service
comment: Le istanze di questa classe rappresentano, tra tutte le attività d'impresa, talune attività di lavanderia e pulitura di articoli tessili e pelliccia. @it
comment: The instances of this class represent, among all the business activities, some laundry and cleaning of textile and fur items.
label: Lavenderie e tintorie @it

Leasing of intellectual property
type: Class
subclass of: Cultural Activity
comment: Le istanze di questa classe rappresentano, tra tutte le attività d'impresa, talune attività di concessione dei diritti di sfruttamento di proprietà intellettuale e prodotti simili (escluse le opere protette dal copyright). @it
comment: The instances of this class represent, among all business activities, certain activities of granting intellectual property rights and similar products (excluding works protected by copyright).
label: Concessione dei diritti di sfruttamento di proprieta' intellettuale @it

Leather Manufacture
type: Class
subclass of: Industry and manufacturing
comment: Le istanze di questa classe rappresentano, tra tutte le attività d'impresa, talune attività di fabbricazione di articoli in pelle e simili. @it
comment: The instances of this class represent, among all the business activities, certain activities of making leather goods and the like.
label: Produzione in Pelle @it

Legal office
type: Class
subclass of: Financial Service
comment: Le istanze di questa classe rappresentano, tra tutte le attività d'impresa, talune attività degli studi legali e di contabilità. @it
comment: The instances of this class represent, among all the business activities, certain activities of law firms and accounting.
label: Studi Legali @it

Library
type: Class
subclass of: Cultural Activity
comment: Le istanze di questa classe rappresentano, tra tutte le attività d'impresa, talune attività di biblioteche ed archivi. @it
comment: The instances of this class represent, among all the business activities, some library and archive activities.
label: Biblioteca @it

Lifting and handling equipment rental
type: Class
subclass of: Transfer service and renting
comment: Le istanze di questa classe rappresentano, tra tutte le attività d'impresa, talune attività di noleggio senza operatore di attrezzature di sollevamento e movimentazione merci. @it
comment: The instances of this class represent, among all business activities, certain rental activities without a lifting and handling equipment operator.
label: Noleggio attrezzature sollevamento e movimentazione @it

Lighting
type: Class
subclass of: Shopping and service
comment: Le istanze di questa classe rappresentano, tra tutte le attività d'impresa, talune attività di commercio al dettaglio di articoli per l'illuminazione. @it
comment: The instances of this class represent, among all the business activities, certain retail activities of lighting articles.
label: Illuminazione @it

literary cafe
type: Class
subclass of: Wine And Food
comment: Ciascuna istanza di questa classe rappresenta un caffè letterario. @it
comment: Each instance of this class represents a literary café.
label: caffe letterario @it

Local health authority
type: Class
subclass of: Health Care
comment: Le istanze di questa classe rappresentano, tra tutte le sedi di servizi, talune aziende sanitarie locali. @it
comment: The instances of this class represent, among all service locations, some local health companies.
label: Asl @it

Local police
type: Class
subclass of: Emergency
comment: Le istanze di questa classe rappresentano, tra tutte le sedi di servizi, taluni uffici della Polizia Locale. @it
comment: The instances of this class represent, among all service locations, some Local Police Offices.
label: Polizia municipale @it

Logistics Activities
type: Class
subclass of: Transfer service and renting
comment: Le istanze di questa classe rappresentano, tra tutte le attività d'impresa, talune attività inerenti movimentazione e lo stoccaggio delle merci, ed in particolare: servizi logistici relativi alla distribuzione delle merci; spedizionieri e agenzie di operazioni doganali; intermediari dei trasporti. @it
comment: The instances of this class represent, among all business activities, certain activities related to handling and storage of goods, and in particular: logistical services relating to the distribution of goods; freight forwarders and customs agency agencies; transport intermediaries.
label: Attivita' di Logistica @it

TPL Lot
type: Class
comment: Insieme di linee TPL, individuabili a livello regionale come lotto. @it
comment: TPL line set, locally identifiable as a lot.
label: Lotto TPL @it

MQTT Broker
type: Class
subclass of: Message Broker
subclass of: Restriction
  on property: MQTT Topic
  min qualified cardinality: 1
  on data range: string
comment: It represents a hardware/software component that acts as an interface between a device or a set of devices (sensors, actuators) and the external, implementing the MQTT protocol.
comment: Modella un componente hardware/software che agisce da interfaccia tra un dispositivo o un insieme di dispositivi (sensori, attuatori) e il mondo esterno implementando il protocollo MQTT. @it
label: Broker MQTT @it

Machinery and Eequipment Rental
type: Class
subclass of: Utilities and supply
comment: Le istanze di questa classe rappresentano, tra tutte le attività d'impresa, talune attività di noleggio di talune macchine ed attrezzature ad uso professionale, ed in particolare: noleggio di macchine e attrezzature per lavori edili e di genio civile; noleggio di macchine e attrezzature per ufficio (inclusi i computer); noleggio di macchine e attrezzature agricole; noleggio di altre macchine, attrezzature e beni materiali, senza operatore. @it
comment: The instances of this class represent, among all the business activities, certain rental activities of certain machines and equipment for professional use, and in particular: rental of machines and equipment for construction work and civil engineering; hire of office machinery and equipment (including computers); rental of agricultural machinery and equipment; hire of other machines, equipment and material assets, without operator.
label: Noleggio macchinari e attrezzature @it

Machinery Repair and Installation
type: Class
subclass of: Industry and manufacturing
comment: Le istanze di questa classe rappresentano, tra tutte le attività d'impresa, talune attività di riparazione e manutenzione di attrezzature ad uso sia professionale che domestico. @it
comment: The instances of this class represent, among all business activities, some repair and maintenance activities for both professional and domestic equipment.
label: Riparazione Manutenzione Macchinari Utensili @it

Maintenance Repair of Motor Vehicles
type: Class
subclass of: Shopping and service
comment: Le istanze di questa classe rappresentano, tra tutte le attività d'impresa, talune attività di riparazione e manutenzione di autoveicoli, ed in particolare: riparazioni meccaniche di autoveicoli; riparazione di carrozzerie di autoveicoli; riparazione di impianti elettrici e di alimentazione per autoveicoli; riparazione e sostituzione di pneumatici per autoveicoli; manutenzione e riparazione di autoveicoli; altre attivita' di manutenzione e di riparazione di autoveicoli. @it
comment: The instances of this class represent, among all the business activities, certain repair and maintenance activities for motor vehicles, in particular: mechanical repairs of motor vehicles; repair of carrozzerie of cars; repair of electrical installations and of alimentacion for cars; repair and replacement of tires for cars; maintenance and repair of cars; other attivita 'of maintenance and of repair of cars.
label: Manutenzione Riparazione Autoveicoli @it

Maintenance Repair of Motorcycles
type: Class
subclass of: Shopping and service
comment: Le istanze di questa classe rappresentano, tra tutte le attività d'impresa, talune attività di manutenzione e riparazione di motocicli e ciclomotori (inclusi i pneumatici). @it
comment: The instances of this class represent, among all business activities, some maintenance and repair activities on motorcycles and mopeds (including tires).
label: Manutenzione Riparazione Motocicli @it

Management consultancy
type: Class
subclass of: Utilities and supply
comment: Le istanze di questa classe rappresentano, tra tutte le attività d'impresa, talune attività di consulenza imprenditoriale, ed in particolare: pubbliche relazioni e comunicazione; talune attività di consulenza imprenditoriale e amministrativo-gestionale; talune attività di pianificazione aziendale; attività delle holding impegnate nelle attività gestionali (holding operative); attività di consulenza gestionale; attività di consulenza per la gestione della logistica aziendale; attività di direzione aziendale e di consulenza gestionale. @it
comment: The instances of this class represent, among all the business activities, certain entrepreneurial consultancy activities, and in particular: public relations and communication; certain entrepreneurial and administrative-management consultancy activities; certain business planning activities; holdings of the holdings engaged in operating activities (holding companies); management consultancy activities; consultancy services for the management of company logistics; business management and management consulting.
label: Consulenza Imprenditoriale e Gestionale @it

Maneuver
type: Class
subclass of: Manoeuver
subclass of: Restriction
  on property: Concerning node
  qualified cardinality: 1
  on class: Node
subclass of: Restriction
  on property: Has first element
  qualified cardinality: 1
  on class: Road element
subclass of: Restriction
  on property: Has second element
  qualified cardinality: 1
  on class: Road element
subclass of: Restriction
  on property: Has third element
  max qualified cardinality: 1
  on class: Road element
comment: Class whose instances are the possible maneuvers that can be made on a road element.
comment: Classe le cui istanze sono le possibili manovre che possono essere effettuate su un elemento stradale. @it
label: Manovra @it

Manicure and pedicure
type: Class
subclass of: Shopping and service
comment: Le istanze di questa classe rappresentano, tra tutte le attività d'impresa, taluni servizi di manicure e pedicure. @it
comment: The instances of this class represent, among all business activities, certain manicure and pedicure services.
label: Manicure e pedicure @it

Manufacture of Basic Metals
type: Class
subclass of: Industry and manufacturing
comment: Le istanze di questa classe rappresentano, tra tutte le attività d'impresa, talune attività di lavorazione dei metalli, ed in particolare: produzione di metalli preziosi e semilavorati; fusione di ghisa e produzione di tubi e raccordi in ghisa; fusione di acciaio; fabbricazione di ferro, acciaio e ferroleghe; stiratura a freddo di barre; fusione di metalli leggeri; fonderie; fabbricazione di tubi, condotti, profilati cavi e relativi accessori in acciaio (esclusi quelli in acciaio colato); produzione di piombo, zinco e stagno e semilavorati; produzione di altri metalli non ferrosi e semilavorati; fusione di taluni metalli non ferrosi; laminazione a freddo di nastri; produzione di metalli di base preziosi e altri metalli non ferrosi; trattamento dei combustibili nucleari; produzione di rame e semilavorati; fabbricazione di taluni prodotti della prima trasformazione dell'acciaio; trafilatura a freddo; produzione di alluminio e semilavorati; fabbricazione di ferro, acciaio e ferroleghe; talune altre attività metallurgiche; talune altre attività siderurgiche. @it
comment: The instances of this class represent, among all the business activities, certain metalworking activities, and in particular: manufacture of precious and semi-finished metals; casting of cast iron and production of cast iron pipes and fittings; casting steel; manufacture of iron, steel and ferroleghe; cold ironing of bars; melting of light metals; foundries; manufacture of pipes, ducts, cable profiles and related accessories in steel (excluding those cast-iron); production of lead, zinc and pond and semilavorati; production of other metals non ferrosi and semilavorati; fusion of certain non-ferrous metals; cold rolling of strips; production of precious metal base and other non-ferrous metals; treatment of nuclear fuels; copper and semi-finished products; manufacture of certain products of the first steel processing; cold drawing; production of aluminum and semilavorati; manufacture of iron, steel and ferroleghe; certain other metallurgical activities; certain other steelworks.
label: Attivita' Metallurgiche @it

Manufacture of Chemicals Products
type: Class
subclass of: Industry and manufacturing
comment: Le istanze di questa classe rappresentano, tra tutte le attività d'impresa, talune attività di produzione di preparati chimici, ed in particolare a titolo esemplificativo: gas industriali, profumi, cosmetici, saponi, agenti organici tensioattivi, prodotti per la lucidatura, fertilizzanti, composti azotati, trattamento chimico degli acidi grassi, materie plastiche, gomma sintetica, colle, pitture, vernici, smalti, inchiostri da stampa, mastici, fibre, prodotti per uso fotografico, oli essenziali, prodotti chimici per l'agricoltura, concimi. @it
comment: The claims of this class represent, among all the business activities, certain chemical production activities, and in particular by way of example: industrial gases, perfumes, cosmetics, soaps, surfactant organic agents, polishing products, fertilizers, Nitrogen compounds, chemical treatment of fatty acids, plastics, synthetic rubber, glues, paints, varnishes, enamels, printing inks, mastics, fibers, photographic products, essential oils, chemicals for agriculture, fertilizers.
label: Produzione Prodotti Chimici @it

Manufacture of Clay and Ceramic
type: Class
subclass of: Industry and manufacturing
comment: Le istanze di questa classe rappresentano, tra tutte le attività d'impresa, talune attività di produzione di mattoni, tegole, altri materiali in terracotta ad uso edilizio, ceramiche, porcellane. @it
comment: The instances of this class represent, among all the business activities, certain brickwork, tiles, other terracotta materials for building, ceramics, porcelain.
label: Produzione Ceramica e Terracotta @it

Manufacture of Electrical Equipment
type: Class
subclass of: Industry and manufacturing
comment: Le istanze di questa classe rappresentano, tra tutte le attività d'impresa, talune attività di fabbricazione di componenti ed apparecchiature elettriche ed elettroniche, quali in particolare: motori, generatori e trasformatori elettrici; apparecchiature per le reti di distribuzione e il controllo dell'elettricità; apparecchiature elettriche e per illuminazione; attrezzature per cablaggio; capacitori elettrici, resistenze, condensatori e simili, acceleratori; insegne elettriche e apparecchiature elettriche di segnalazione; apparecchiature di illuminazione e segnalazione per mezzi di trasporto; elettrodomestici; apparecchi per uso domestico non elettrici; apparecchiature elettriche per saldature e brasature; fili e cavi elettrici ed elettronici;batterie di pile ed accumulatori elettrici. @it
comment: The instances of this class represent, among all the business activities, certain manufacturing of electrical and electronic components and equipment, such as: motors, generators and transformers; equipment for distribution and control of electricity; electrical and lighting equipment; wiring harness; electric capacitors, resistors, capacitors and the like, accelerators; electrical signs and signaling electrical equipment; lighting and signaling equipment for means of transport; home appliances; non-electric household appliances; electrical equipment for welding and brazing; wires and cables, electrical and electronic; battery batteries and electrical accumulators.
label: Produzione Apparecchiature Elettriche @it

Manufacture of Electronic Products
type: Class
subclass of: Industry and manufacturing
comment: Le istanze di questa classe rappresentano, tra tutte le attività d'impresa, talune attività di fabbricazione di apparecchiature e componenti elettronici, quali in particolare:strumenti per irradiazione, apparecchiature elettromedicali ed elettroterapeutiche; apparecchi per la riproduzione e registrazione del suono e delle immagini; computer e unita' periferiche; componenti elettronici e schede elettroniche; supporti magnetici ed ottici; apparecchi trasmittenti radiotelevisivi (incluse le telecamere); orologi; taluni apparecchi di misura e regolazione, di contatori di elettricità, gas, acqua ed altri liquidi, di bilance analitiche di precisione (incluse parti staccate ed accessori); apparecchi elettrici ed elettronici per telecomunicazioni; schede elettroniche assemblate; elementi ottici e strumenti ottici di precisione; apparecchi elettrici ed elettronici per telecomunicazioni; fabbricazione di strumenti e apparecchi di misurazione, prova e navigazione (esclusi quelli ottici); strumenti ottici e attrezzature fotografiche e cinematografiche; sistemi antifurto e antincendio; strumenti per idrologia, geofisica e meteorologia. @it
comment: The instances of this class represent, among all the business activities, certain manufacturing of electronic equipment and components, such as: irradiation equipment, electromedical and electrotherapeutic equipment; apparatus for the reproduction and recording of sound and images; computers and peripheral units; electronic components and electronic boards; magnetic and optical supports; radio and television transmitting equipment (including cameras); watches; certain measuring and regulating apparatus for meters of electricity, gas, water and other liquids, precision analytical scales (including stapled parts and accessories); electrical and electronic equipment for telecommunications; assembled electronic boards; optical elements and optical precision instruments; electrical and electronic equipment for telecommunications; manufacture of instruments and apparatus for measuring, testing and navigation (other than optical); optical instruments and photographic and cinematographic equipment; anti-theft and fire-fighting systems; tools for hydrology, geophysics and meteorology.
label: Produzione Prodotti Elettronici @it

Manufacture of Furniture
type: Class
subclass of: Industry and manufacturing
comment: Le istanze di questa classe rappresentano, tra tutte le attività d'impresa, talune attività di fabbricazione di mobili e complementi d'arredo, quali in particolare: taluni mobili per ufficio e negozi; poltrone e divani; finitura di mobili; mobili per arredo domestico; parti e accessori di mobili; mobili per cucina; materassi; talune sedie e sedili. @it
comment: The instances of this class represent, among all the business activities, certain furniture manufacturing and furnishing, such as: office furniture and shops; armchairs and sofas; furniture finishing; furniture for domestic furniture; parts and accessories of furniture; kitchen furniture; mattresses; some chairs and seats.
label: Produzione Mobili @it

Manufacture of Glass
type: Class
subclass of: Industry and manufacturing
comment: Le istanze di questa classe rappresentano, tra tutte le attività d'impresa, talune attività di fabbricazione, lavorazione e trasformazione di prodotti in vetro piano, cavo e artistico. @it
comment: The instances of this class represent, among all the business activities, certain manufacturing, processing and processing of flat, cable and artistic glass products.
label: Produzione e Lavorazione Vetro @it

Manufacture of Jewellery Bijouterie
type: Class
subclass of: Industry and manufacturing
comment: Le istanze di questa classe rappresentano, tra tutte le attività d'impresa, talune attività di fabbricazione di gioielleria, bigiotteria, pietre preziose e monete. @it
comment: The instances of this class represent, among all the business activities, certain jewelry manufacturing, jewelery, precious stones and coins.
label: Produzione Gioielleria Bigiotteria @it

Manufacture of Machinery and Equipment
type: Class
subclass of: Industry and manufacturing
comment: Le istanze di questa classe rappresentano, tra tutte le attività d'impresa, talune attività di fabbricazione di macchinari, inclusi a titolo di esempio: elettrodomestici; condizionatori; depuratori; macchinari industriali per l'industria alimentare; macchinari per le lavanderie; macchinari per l'industria della plastica e della gomma; macchinari per la stampa e la legatoria; macchinari per il sollevamento e la movimentazione delle merci; pompe; macchinari per miniere, cave, cantieri; macchinari per l'industria tessile; macchinari per l'industria della carta; forni, fornaci, bruciatori; macchine per la lavorazione delle pelli; sistemi di riscaldamento; macchine per l'agricoltura, la silvicoltura e la zootecnia; macchine ed attrezzature per ufficio; cartucce e toner; ascensori, montacarichi, scale mobili; turbine; apparecchiature per istituti di bellezza. @it
comment: The instances of this class represent, among all business activities, certain machine manufacturing activities, including, for example: household appliances; conditioners; purifiers; industrial machinery for the food industry; machinery for laundries; machinery for the plastics and rubber industry; machinery for printing and binding; machinery for lifting and handling of goods; pumps; machinery for mines, quarries, construction sites; machinery for the textile industry; machinery for the paper industry; furnaces, furnaces, burners; leather processing machines; heating systems; machines for the agriculture, the silvicoltura and the zootecnia; office machinery and equipment; cartridges and toners; elevators, hoists, escalators; turbines; equipment for beauty salons.
label: Produzione Macchinari e Utensili @it

Manufacture of Motor Vehicles
type: Class
subclass of: Industry and manufacturing
comment: Le istanze di questa classe rappresentano, tra tutte le attività d'impresa, talune attività di fabbricazione di autoveicoli e rimorchi, carrozzerie e componentistica, inclusi i componenti elettrici ed elettronici. @it
comment: The instances of this class represent, among all the business activities, certain manufacturing of motor vehicles and trailers, bodywork and components, including electrical and electronic components.
label: Produzione Autoveicoli @it

Manufacture of Musical Instruments
type: Class
subclass of: Industry and manufacturing
comment: Le istanze di questa classe rappresentano, tra tutte le attività d'impresa, talune attività di fabbricazione di strumenti musicali (incluse parti ed accessori). @it
comment: The instances of this class represent, among all business activities, certain activities of making musical instruments (including parts and accessories).
label: Produzione Strumenti Musicali @it

Manufacture of Non-Metallic Mineral Products
type: Class
subclass of: Industry and manufacturing
comment: Le istanze di questa classe rappresentano, tra tutte le attività d'impresa, talune attività di fabbricazione di prodotti con minerali non metalliferi inclusi i prodotti abrasivi. @it
comment: The instances of this class represent, among all business activities, certain manufacturing activities of non-metallic mineral products including abrasive products.
label: Produzione Prodotti Minerali non Metalliferi @it

Manufacture of Paper
type: Class
subclass of: Industry and manufacturing
comment: Le istanze di questa classe rappresentano, tra tutte le attività d'impresa, talune attività di fabbricazione della carta e dei prodotti in carta. @it
comment: The instances of this class represent, among all the business activities, certain paper and paper making activities.
label: Industria della Carta @it

Manufacture of Paper Products
type: Class
subclass of: Industry and manufacturing
comment: Le istanze di questa classe rappresentano, tra tutte le attività d'impresa, talune attività di fabbricazione di prodotti in carta, ed in particolare: carta e cartone ondulato e di imballaggi di carta e cartone (esclusi quelli in carta pressata); articoli di carta e cartone; prodotti cartotecnici; prodotti igienico-sanitari e per uso domestico in carta e ovatta di cellulosa. @it
comment: The instances of this class represent, among all the business activities, certain activities of making paper products, and in particular: corrugated paper and paperboard and paper and board packaging (other than paperboard); Articles of paper and cartone; Paper products; Sanitary and household products in paper and cellulose wadding.
label: Produzione Prodotti di Carta @it

Manufacture of Pharmaceutical Products
type: Class
subclass of: Industry and manufacturing
comment: Le istanze di questa classe rappresentano, tra tutte le attività d'impresa, talune attività di fabbricazione medicinali e preparati farmaceutici. @it
comment: The instances of this class represent, among all the business activities, certain pharmaceutical manufacturing and pharmaceutical preparations.
label: Produzione Prodotti Farmaceutici @it

Manufacture of Plastics Products
type: Class
subclass of: Industry and manufacturing
comment: Le istanze di questa classe rappresentano, tra tutte le attività d'impresa, talune attività di fabbricazione di articoli in materia plastica, quali ad esempio: articoli in plastica per l'edilizia; parti in plastica per calzature; lastre, fogli, tubi e profilati in materie plastiche; porte, finestre, intelaiature in plastica; oggetti per l'ufficio e la scuola in plastica. @it
comment: The instances of this class represent, among all the business activities, certain plastic products manufacturing activities, such as: plastic articles for the building; plastic parts for footwear; sheets, sheets, tubes and profilati in plastic materials; doors, windows, plastic frames; office items and plastic school.
label: Produzione Prodotti di Plastica @it

Manufacture of Refined Petroleum Products
type: Class
subclass of: Industry and manufacturing
comment: Le istanze di questa classe rappresentano, tra tutte le attività d'impresa, talune attività di raffinamento del petrolio, ed in particolare:preparazione o miscelazione di derivati del petrolio (esclusa la petrolchimica) fabbricazione di emulsioni di bitume, di catrame e di leganti per uso stradale miscelazione di gas petroliferi liquefatti (GPL) e loro imbottigliamento. @it
comment: The instances of this class represent, among all business activities, certain petroleum refining activities, and in particular: preparation or mixing of petroleum derivatives (excluding petrochemicals), manufacture of bitumen, tar and binder emulsions for use road mixing of liquefied petroleum gas (GPL) and bottling them.
label: Produzione Prodotti Petroliferi Raffinati @it

Manufacture of Refractory Products
type: Class
subclass of: Industry and manufacturing
comment: Le istanze di questa classe rappresentano, tra tutte le attività d'impresa, talune attività di fabbricazione di prodotti refrattari. @it
comment: The instances of this class represent, among all business activities, certain refractory products manufacturing.
label: Produzione Prodotti Refrattari @it

Manufacture of Rubber and Plastics Products
type: Class
subclass of: Industry and manufacturing
comment: Le istanze di questa classe rappresentano, tra tutte le attività d'impresa, talune attività di fabbricazione di articoli in gomma e materie plastiche. @it
comment: The instances of this class represent, among all the business activities, certain manufacturing of rubber articles and plastics.
label: Produzione Prodotti di Gomma e Plastica @it

Manufacture of Rubber Products
type: Class
subclass of: Industry and manufacturing
comment: Le istanze di questa classe rappresentano, tra tutte le attività d'impresa, talune attività di fabbricazione di prodotti in gomma, inclusi in particolare: suole di gomma e altre parti in gomma per calzature; fabbricazione di pneumatici e camere d'aria; rigenerazione e ricostruzione di pneumatici. @it
comment: The instances of this class represent, among all the business activities, certain manufacturing activities of rubber products, including in particular: rubber soles and other rubber parts for footwear; manufacture of tires and air chambers; regeneration and reconstruction of tires.
label: Produzione Prodotti di Gomma @it

Manufacture of Sports Goods
type: Class
subclass of: Industry and manufacturing
comment: Le istanze di questa classe rappresentano, tra tutte le attività d'impresa, talune attività di fabbricazione di articoli sportivi. @it
comment: The instances of this class represent, among all the business activities, certain activities in the manufacture of sports goods.
label: Produzione Articoli Sportivi @it

Manufacture of Structural Metal Products
type: Class
subclass of: Industry and manufacturing
comment: Le istanze di questa classe rappresentano, tra tutte le attività d'impresa, talune attività di fabbricazione di prodotti metallici, tra cui ad esempio: telai di porte e finestre; cancelli; cerniere; intelaiature ed altri elementi di costruzione; pentole e stoviglie; radiatori; molle; armi e munizioni; bidoni e contenitori in genere. @it
comment: The instances of this class represent, among all the business activities, some metal products manufacturing activities, such as: door frames and windows; gates; hinges; frames and other building elements; pots and crockery; radiators; springs; weapons and ammunition; bins and containers in general.
label: Produzione Prodotti in Metallo @it

Manufacture of textiles
type: Class
subclass of: Industry and manufacturing
comment: Le istanze di questa classe rappresentano, tra tutte le attività d'impresa, talune industrie tessili. @it
comment: The instances of this class represent, among all business activities, certain textile industries.
label: Industrie Tessili @it

Manufacture of Toys and Game
type: Class
subclass of: Industry and manufacturing
comment: Le istanze di questa classe rappresentano, tra tutte le attività d'impresa, talune attività di fabbricazione di giochi e giocattoli. @it
comment: The instances of this class represent, among all the business activities, some toys and toys manufacturing activities.
label: Produzione giocattoli e giochi @it

Manufacture of Transport Equipment
type: Class
subclass of: Industry and manufacturing
comment: Le istanze di questa classe rappresentano, tra tutte le attività d'impresa, talune attività di fabbricazione di veicoli ed accessori, quali in particolare: accessori e pezzi staccati per motocicli e ciclomotori; navi e imbarcazioni; motocicli e motoveicoli (inclusi i motori); parti ed accessori per biciclette; locomotive e altro materiale rotabile ferroviario, tranviario, filoviario, per metropolitane e per miniere; biciclette; costruzioni metalliche e non metalliche in cantieri navali; aeromobili, veicoli spaziali e relativi dispositivi; veicoli per invalidi (incluse parti e accessori). @it
comment: The instances of this class represent, among all the business activities, certain vehicle manufacturing and accessories activities, such as: accessories and parts detached for motorcycles and mopeds; ships and boats; motorcycles and motor vehicles (including engines); parts and accessories for bicycles; locomotives and other railway rolling stock, tranviario, filoviario, for metropolitane and for mines; bicycles; buildings metalliche and no metalliche in cantieri naval; aircraft, spacecraft and related devices; invalid vehicles (including parts and accessories).
label: Produzione Mezzi di Trasporto @it

Manufacture of Travel Articles
type: Class
subclass of: Industry and manufacturing
comment: Le istanze di questa classe rappresentano, tra tutte le attività di impresa, talune attività di fabbricazione di articoli da viaggio, borse e simili, pelletteria e selleria, frustini e scudisci per equitazione. @it
comment: The instances of this class represent, among all the business activities, certain activities of making travel articles, handbags and the like, leather goods and saddlery, whips and shawls for riding.
label: Produzione Articoli da Viaggio @it

Manufacture of Wearing Apparel
type: Class
subclass of: Industry and manufacturing
comment: Le istanze di questa classe rappresentano, tra tutte le attività d'impresa, talune attività di fabbricazione di articoli di vestiario, quali ad esempio: abbigliamento in pelle; pellicce; divise ed indumenti da lavoro; abiti su misura; camicie, magliette, biancheria intima; abbigliamento sportivo e abbigliamento tecnico in genere. @it
comment: The instances of this class represent, among all the business activities, certain fabrication of garments, such as: leather clothing; fur coats; uniforms and work clothes; custom-made suits; shirts, shirts, underwear; sports clothing and technical clothing in general.
label: Confezione Abbigliamento @it

Manufacture of Wood
type: Class
subclass of: Industry and manufacturing
comment: Le istanze di questa classe rappresentano, tra tutte le attività d'impresa, talune attività dell'industria del legno e dei prodotti in legno e in sughero, e dedite alla fabbricazione di articoli in paglia e altri prodotti da intreccio. @it
comment: The instances of this class represent, among all the business activities, certain activities of the wood and wood and cork products industry, and are involved in the manufacture of straw articles and other plaiting products.
label: Industria del Legno @it

Manufacture of Wood Products
type: Class
subclass of: Industry and manufacturing
comment: Le istanze di questa classe rappresentano, tra tutte le attività d'impresa, talune attività di produzione di articoli in legno, quali ad esempio: articoli per l'edilizia; cornici; imballaggi; infissi; prodotti in sughero, paglia, e altri materiali da intreccio; pannelli in legno; parquet. @it
comment: The instances of this class represent, among all the business activities, certain wood products production activities, such as: building materials; picture frames; packaging; fixtures; cork products, straw, and other weaving materials; wood panels; parquet.
label: Produzione Prodotti in Legno @it

Marina
type: Class
subclass of: Entertainment
comment: Ciascuna istanza di questa classe rappresenta un porto turistico. @it
comment: Each instance of this class represents a marina.
label: Porto turistico @it

Market polling
type: Class
subclass of: Advertising
comment: Le istanze di questa classe rappresentano, tra tutte le attività d'impresa, talune attività specializzate in ricerche di mercato e sondaggi di opinione. @it
comment: The instances of this class represent, among all the business activities, certain activities specializing in market research and opinion polls.
label: Ricerche di mercato @it

Materials Recovery
type: Class
subclass of: Environment
comment: Le istanze di questa classe rappresentano, tra tutte le attività d'impresa, talune attività relative al riciclo e allo smaltimento dei rifiuti, quali ad esempio: recupero e preparazione per il riciclaggio di cascami e rottami metallici; recupero e preparazione per il riciclaggio dei rifiuti solidi urbani, industriali e biomasse; recupero e preparazione per il riciclaggio di materiale plastico per produzione di materie prime plastiche, resine sintetiche; demolizione di carcasse. @it
comment: The instances of this class represent, among all business activities, certain recycling and waste disposal activities, such as: recovery and preparation for recycling waste and scrap metal; recovery and preparation for the recycling of solid urban waste, industrial and biomass; recovery and preparation for the recycling of plastic material for the production of plastic raw materials, synthetic resins; demolition of carcasses.
label: Recupero Materiali @it

Limitations
type: Class
subclass of: Restriction
comment: Ciascuna istanza di questa classe rappresenta limitazioni alla velocità o alle dimensioni dei veicoli. @it
comment: The instances of this class represent each a limitation that apply to the speed or to the size or weight of vehicles.
label: Limitazioni @it

Meat and Poultry
type: Class
subclass of: Shopping and service
comment: Le istanze di questa classe rappresentano, tra tutte le attività d'impresa, talune attività di commercio al dettaglio di carni e di prodotti a base di carne. @it
comment: The instances of this class represent, among all business activities, certain retail trade activities of meat and meat products.
label: Carne e Pollame @it

Mechanic Workshop
type: Class
subclass of: Shopping and service
comment: Le istanze di questa classe rappresentano, tra tutte le attività d'impresa, talune attività di officina. @it
comment: The instances of this class represent, among all the business activities, some workshop activities.
label: Officina @it

Medical analysis laboratories
type: Class
subclass of: Health Care
comment: Le istanze di questa classe rappresentano, tra tutte le attività d'impresa, taluni laboratori di analisi cliniche, laboratori radiografici ed altri centri di diagnostica per immagini. @it
comment: The instances of this class represent, among all business activities, some clinical analysis laboratories, radiographic laboratories and other image diagnostic centers.
label: Laboratori analisi mediche @it

Medical and Orthopaedic Goods
type: Class
subclass of: Shopping and service
comment: Le istanze di questa classe rappresentano, tra tutte le attività d'impresa, talune attività di commercio al dettaglio di articoli medicali e ortopedici. @it
comment: The instances of this class represent, among all the business activities, certain retail activities of medical and orthopedic articles.
label: Articoli Medicali e Ortopedici @it

Mental health centre
type: Class
subclass of: Health Care
comment: Le istanze di questa classe rappresentano, tra tutte le sedi di servizi, taluni centri di salute mentale. @it
comment: The instances of this class represent, among all service locations, certain centers of mental health.
label: Centri di salute mentale @it

milestone mileage
type: Class
subclass of: SpatialThing
subclass of: Restriction
  on property: latitude
  max cardinality: 1
subclass of: Restriction
  on property: longitude
  max cardinality: 1
comment: Classe le cui istanze sono i cippi chilometrici che si trovano lungo le principali strade
label: Cippo chilometrico @it

Minimarket
type: Class
subclass of: Shopping and service
comment: Le istanze di questa classe rappresentano, tra tutte le attività d'impresa, talune attività di minimercati ed altri esercizi non specializzati di alimentari vari. @it
comment: The instances of this class represent, among all business activities, certain activities of minimarkets and other non-specialized foodstuffs.

Mining and quarrying
type: Class
subclass of: Service
comment: Services related to mining and quarrying.
comment: Servizi legati alle attivita' di estrazione e cave. @it
label: Attivita' estrattive @it

Mining of metal ores
type: Class
subclass of: Mining and quarrying
comment: Le istanze di questa classe rappresentano, tra tutte le attività d'impresa, talune attività di estrazione di minerali metalliferi. @it
comment: The instances of this class represent, among all the business activities, certain activities of extraction of metallic minerals.
label: Estrazione minerali metalliferi @it

Mining Support Services
type: Class
subclass of: Industry and manufacturing
comment: Le istanze di questa classe rappresentano, tra tutte le attività d'impresa, talune attività di supporto alle attività estrattive. @it
comment: The instances of this class represent, among all the business activities, certain mining support services.
label: Servizi Industria Mineraria @it

Mobility event
type: Class
subclass of: Event
comment: Ciascuna istanza di questa classe rappresenta un evento che ha avuto ripercussioni sulla viabilità del territorio coperto dal progetto Km4City, ad esempio un incidente stradale, una perdita di carico, una restrizione della carreggiata, un allagamento, una deviazione per lavori. @it
comment: Each instance of this class represents an event that has had repercussions on the viability of the territory covered by the Km4City project, such as a road accident, a loss of cargo, a roadway restriction, a flood, a work deviation.
label: Evento di mobilità @it

Monitoring camera
type: Class
subclass of: Transfer service and renting
label: Telecamera di controllo @it

Monument location
type: Class
subclass of: Cultural Activity
comment: Le istanze di questa classe rappresentano, tra tutte le attività d'impresa, talune attività di gestione di luoghi e monumenti storici e attrazioni simili. @it
comment: The instances of this class represent, among all business activities, some management of historical sites and monuments and similar attractions.
label: Luogo monumento @it

Motion picture and television programme activities
type: Class
subclass of: Cultural Activity
comment: Le istanze di questa classe rappresentano, tra tutte le attività d'impresa, talune attività di produzione, post-produzione e distribuzione cinematografica, di video e di programmi televisivi. @it
comment: The instances of this class represent, among all the business activities, certain activities of production, post-production and film distribution, video and television programs.
label: Cinema e TV Produzione e Distribuzione @it

Motor Vehicles Wholesale and Retail
type: Class
subclass of: Shopping and service
comment: Le istanze di questa classe rappresentano, tra tutte le attività d'impresa, talune attività di commercio all'ingrosso e al dettaglio di autoveicoli e di intermediazione nella compravendita di autoveicoli. @it
comment: The instances of this class represent, among all business activities, certain wholesale and retail activities of motor vehicles and brokerage in the sale of motor vehicles.
label: Vendita Autoveicoli Ingrosso Dettaglio @it

Motorcycles Parts Wholesale and Retail
type: Class
subclass of: Shopping and service
comment: Le istanze di questa classe rappresentano, tra tutte le attività d'impresa, talune attività di commercio all'ingrosso e al dettaglio di parti e accessori per motocicli e ciclomotori, e di intermediazione nella compravendita di parti e accessori per motocicli e ciclomotori. @it
comment: The instances of this class represent, among all business activities, certain wholesale and retail activities of motorcycle and moped parts and accessories, and brokering in the sale of parts and accessories for motorcycles and mopeds.
label: Vendita Ingrosso Dettaglio Ricambi Motocicli @it

Motorcycles Wholesale and Retail
type: Class
subclass of: Shopping and service
comment: Le istanze di questa classe rappresentano, tra tutte le attività d'impresa, talune attività di commercio all'ingrosso e al dettaglio di motocicli, ciclomotori e loro parti e accessori, e talune attività di intermediazione nella compravendita di motocicli, ciclomotori e loro parti e accessori. @it
comment: The instances of this class represent, among all business activities, certain wholesale and retail activities of motorcycles, mopeds and their parts and accessories, and certain brokering activities in the sale of motorcycles, mopeds and parts thereof and accessories.
label: Vendita Motocicli Ingrosso Dettaglio @it

Mountain shelter
type: Class
subclass of: Accommodation
comment: Le istanze di questa classe rappresentano, tra tutte le attività d'impresa, taluni rifugi di montagna. @it
comment: The instances of this class represent, among all business activities, some mountain shelters.
label: Rifugi di Montagna @it

Municipality Administration
type: Class
subclass of: Public Administration
comment: Class whose instances are the various municipalities.
comment: Classe le cui istanze sono i vari comuni. @it
label: Amministrazione Comunale @it

Museum
type: Class
subclass of: Cultural Activity
comment: Le istanze di questa classe rappresentano, tra tutte le attività d'impresa, talune attività dei musei. @it
comment: The instances of this class represent, among all the business activities, certain activities of the museums.
label: Museo @it

Music and Video Recordings
type: Class
subclass of: Shopping and service
comment: Le istanze di questa classe rappresentano, tra tutte le attività d'impresa, talune attività di commercio al dettaglio di registrazioni musicali e video. @it
comment: The instances of this class represent, among all business activities, certain retail trade activities of music and video recordings.
label: Registrazioni musicali e video @it

Musical Instruments and Scores
type: Class
subclass of: Shopping and service
comment: Le istanze di questa classe rappresentano, tra tutte le attività d'impresa, talune attività di commercio al dettaglio di strumenti musicali e spartiti. @it
comment: The instances of this class represent, among all the business activities, certain retail activities of musical instruments and scores.
label: Strumenti Musicali @it

NGSI Broker
type: Class
subclass of: Message Broker
comment: It represents a hardware/software component that acts as an interface between a device or a set of devices (sensors, actuators) and the external, implementing the NGSI protocol.
comment: Modella un componente hardware/software che agisce da interfaccia tra un dispositivo o un insieme di dispositivi (sensori, attuatori) e il mondo esterno implementando il protocollo NGSI. @it
label: Broker NGSI @it

National park
type: Class
subclass of: Entertainment
comment: Ciascuna istanza di questa classe rappresenta un parco nazionale. @it
comment: Each instance of this class represents a national park.
label: Parco nazionale @it

Natural reserve
type: Class
subclass of: Entertainment
comment: Ciascuna istanza di questa classe rappresenta una riserva naturale. @it
comment: Each instance of this class represents a natural reserve.
label: Riserva naturale @it

News agency
type: Class
subclass of: Cultural Activity
comment: Le istanze di questa classe rappresentano, tra tutte le attività d'impresa, talune attività delle agenzie di stampa. @it
comment: The instances of this class represent, among all the business activities, certain activities of the press agencies.
label: Agenzie di stampa @it

Newspapers and Stationery
type: Class
subclass of: Shopping and service
comment: Le istanze di questa classe rappresentano, tra tutte le attività d'impresa, talune attività di commercio al dettaglio di giornali, riviste, periodici, articoli di cartoleria e forniture per ufficio. @it
comment: The instances of this class represent, among all the business activities, some retail activities of newspapers, magazines, periodicals, stationery and office supplies.
label: Edicole e cartolerie @it

Node
type: Class
subclass of: Node
subclass of: SpatialThing
subclass of: Restriction
  on property: latitude
  qualified cardinality: 1
  on data range: float
subclass of: Restriction
  on property: longitude
  qualified cardinality: 1
  on data range: float
comment: Class whose instances are the nodes that connect the road elements.
comment: Classe le cui istanze sono i nodi che congiungono gli elementi stradali. @it
label: Nodo @it

Noise level sensor
type: Class
subclass of: Environment
comment: Device that detects noise pollution in the environment in which it is located.
comment: Dispositivo che rileva l'inquinamento acustico nell'ambiente in cui è collocato. @it
label: Rilevatore di rumore @it

non food large retailers
type: Class
subclass of: Shopping and service
comment: Le istanze di questa classe rappresentano, tra tutte le sedi di servizi, taluni esercizi di grande distribuzione non alimentare. @it
comment: The instances of this class represent, among all service locations, certain non-food distribution facilities.
label: Grande distribuzione non alimentare @it

Non-Food Products
type: Class
subclass of: Shopping and service
comment: Le istanze di questa classe rappresentano, tra tutte le attività d'impresa, talune attività di commercio al dettaglio di taluni prodotti non alimentari. @it
comment: The instances of this class represent, among all business activities, certain retail activities of certain non-food products.
label: Altri Prodotti non Alimentari @it

Non-specialized Wholesale Trade
type: Class
subclass of: Wholesale
comment: Le istanze di questa classe rappresentano, tra tutte le attività d'impresa, talune attività di commercio all'ingrosso non specializzato. @it
comment: The instances of this class represent, among all business activities, certain non-specialized wholesale activities.
label: Ingrosso Non Specializzato @it

Observation
type: Class
comment: Single sensor for observing speed, traffic, concentration, or density.
comment: Singolo sensore per osservare velocità, traffico, concentrazione o densità. @it
label: Osservazione @it

Office administrative and support activities
type: Class
subclass of: Utilities and supply
comment: Le istanze di questa classe rappresentano, tra tutte le attività d'impresa, talune attività di gestione di uffici temporanei e di supporto anche integrato al lavoro d'ufficio. @it
comment: The instances of this class represent, among all business activities, certain temporary office management and support activities that are also integrated with the work of the office.
label: Supporto per le funzioni d'ufficio @it

Office Furniture
type: Class
subclass of: Shopping and service
comment: Le istanze di questa classe rappresentano, tra tutte le attività d'impresa, talune attività di commercio al dettaglio di mobili per l'ufficio. @it
comment: The instances of this class represent, among all the business activities, some retail activities of office furniture.
label: Mobili per Ufficio @it

Operation of casinos
type: Class
subclass of: Entertainment
comment: Le istanze di questa classe rappresentano, tra tutte le attività d'impresa, talune attività di gestione di apparecchi che consentono vincite in denaro funzionanti a moneta o a gettone. @it
comment: The instances of this class represent, among all business activities, certain asset management activities on devices that allow coin or coin-operated cash prizes.
label: Slot Machines @it

Optics and Photography
type: Class
subclass of: Shopping and service
comment: Le istanze di questa classe rappresentano, tra tutte le attività d'impresa, talune attività di commercio al dettaglio di materiale per ottica e fotografia. @it
comment: The instances of this class represent, among all business activities, certain retail trade of optical and photographic material.
label: Ottica e Fotografia @it

Organization of conventions and trade shows
type: Class
subclass of: Utilities and supply
comment: Le istanze di questa classe rappresentano, tra tutte le attività d'impresa, talune attività di organizzazione di convegni e fiere. @it
comment: The instances of this class represent, among all the business activities, certain activities of organizing conferences and fairs.
label: Organizzazione di convegni e fiere @it

Rappresentatione di flussi di origine-destinazione
type: Class
subclass of: High level type
comment: Rappresentatione di flussi di origine-destinazione per multiple tipologie di entità. @it
comment: Representation of origin-destination flows for multiple kind of entities.

Other Accommodation
type: Class
subclass of: Accommodation
comment: Le istanze di questa classe rappresentano, tra tutte le attività d'impresa, talune attività di affittacamere per brevi soggiorni, case ed appartamenti per vacanze, bed and breakfast, residence, alloggi connessi alle aziende agricole, alloggi per studenti e lavoratori con alcuni servizi alberghieri. @it
comment: The instances of this class represent, among all the business activities, certain activities of short-term renters, holiday houses and apartments, bed and breakfasts, residences, farm-related accommodation, student and workers accommodation with some hotel services.
label: Altre sistemazioni @it

Other broadcasting
type: Class
subclass of: Cultural Activity
comment: Le istanze di questa classe rappresentano, tra tutte le attività d'impresa, talune attività di programmazione e trasmissione audiovisiva. @it
comment: The instances of this class represent, among all business activities, certain activities of audio-visual programming and broadcasting.
label: Altre emittenti @it

Other Goods
type: Class
subclass of: Shopping and service
comment: Le istanze di questa classe rappresentano, tra tutte le attività d'impresa, talune attività di commercio al dettaglio di taluni prodotti in esercizi specializzati. @it
comment: The instances of this class represent, among all business activities, certain retail activities of certain products in specialized stores.
label: Articoli Vari @it

Other Manufacturing
type: Class
subclass of: Industry and manufacturing
comment: Le istanze di questa classe rappresentano, tra tutte le attività d'impresa, le attività produttive non diversamente classificate. @it
comment: The instances of this class represent, among all the business activities, the manufacturing activities that do not fall under any of the defined categories.
label: Altre Industrie Manifatturiere @it

Other mining and quarrying
type: Class
subclass of: Mining and quarrying
comment: Le istanze di questa classe rappresentano, tra tutte le attività d'impresa, talune attività di estrazione di minerali da cave e miniere. @it
comment: The instances of this class represent, among all the business activities, certain mining and quarry mining activities.
label: Estrazione di altri minerali @it

Other Office
type: Class
subclass of: Government Office
comment: Le istanze di questa classe rappresentano, tra tutte le attività d'impresa, talune attività di amministrazione pubblica e difesa, e di assicurazione sociale obbligatoria. @it
comment: The instances of this class represent, among all service locations, certain public and defense administration activities and compulsory social insurance.
label: Altri Uffici @it

Other Retail Sale
type: Class
subclass of: Shopping and service
comment: Le istanze di questa classe rappresentano, tra tutte le attività d'impresa, talune attività di commercio al dettaglio in esercizi non specializzati con prevalenza di prodotti non alimentari. @it
comment: The instances of this class represent, among all business activities, certain retail activities in non-specialized businesses with a prevalence of non-food products.
label: Altri Esercizi @it

Other Specialized Construction
type: Class
subclass of: Civil and edil engineering
comment: Le istanze di questa classe rappresentano, tra tutte le attività d'impresa, talune attività di costruzione, comprese ad esempio le attività di pulizia a vapore, sabbiatura e attività simili per pareti esterne di edifici; costruzione di piscine ed altri lavori specializzati di costruzione; attività non specializzate di lavori edili (muratori); lavori di completamento e di finitura degli edifici; realizzazione di coperture; noleggio di gru ed altre attrezzature con operatore per la costruzione o la demolizione. @it
comment: The instances of this class represent, among all the business activities, certain construction activities, including, for example: steam cleaning, sandblasting and similar activities for exterior walls of buildings; building of swimming pools and other skilled works of building; non-specialized works of construction work (masons); works of completamento and of finitura of the buildings; realization of coverings; hire of cranes and other equipment with operator for construction or demolition.
label: Altri Lavori Costruzione Specializzati @it

Other Specialized Wholesale
type: Class
subclass of: Wholesale
comment: Le istanze di questa classe rappresentano, tra tutte le attività d'impresa, talune attività di commercio all'ingrosso, ad esempio di: fibre tessili gregge e semilavorate; ferramenta, di apparecchi e accessori per impianti idraulici e di riscaldamento; fertilizzanti e di altri prodotti chimici per l'agricoltura; moquette e linoleum; gomma greggia, materie plastiche in forme primarie e semilavorati; prodotti chimici; infissi; materiali da costruzione; prodotti petroliferi e lubrificanti per autotrazione, di combustibili per riscaldamento; prodotti chimici per l'industria; carta da parati, colori e vernici; legname, semilavorati in legno e legno artificiale; materiali da costruzione (inclusi gli apparecchi igienico-sanitari); materiali per rivestimenti (inclusi gli apparecchi igienico-sanitari); minerali metalliferi, di metalli ferrosi e prodotti semilavorati; metalli non ferrosi e prodotti semilavorati; articoli in ferro e in altri metalli (ferramenta); imballaggi; legname e di materiali da costruzione, apparecchi igienico-sanitari, vetro piano, vernici e colori; rottami e sottoprodotti metallici della lavorazione industriale; apparecchi e accessori per impianti idraulici, di riscaldamento e di condizionamento; materiali di recupero non metallici (vetro, carta, cartoni eccetera); sottoprodotti non metallici della lavorazione industriale (cascami). @it
comment: The instances of this class represent, among all business activities, certain wholesale trade activities, such as: raw textile fibers and semi-finished textiles; hardware, appliances and accessories for plumbing and heating systems; fertilizers and other chemical products for agriculture; carpet and linoleum; raw rubber, plastics in primary and semi-finished forms; chemical products; fixtures; building materials; petroleum products and lubricants for haulage, of fuels for heating; chemical products for the industry; wallpaper, colors and paints; timber, semi-finished wood and artificial wood; building materials (including sanitary fixtures); coating materials (including sanitary fixtures); metallic minerals, of ferrous metals and semi-finished products; non-ferrous metals and semi-finished products; articles of iron and of other metals; packaging; timber and construction materials, sanitary fixtures, flat glass, paints and colors; scrap and metal by-products of industrial processing; appliances and accesorios for installations of fontaneras, heating and air conditioning; non-metallic recovery materials (glass, paper, cardboard, etc.); non-metallic by-products of industrial processing (waste).
label: Ingrosso Specializzato @it

Other Telecommunications Activities
type: Class
subclass of: Utilities and supply
comment: Le istanze di questa classe rappresentano, tra tutte le attività d'impresa, talune attività di telecomunicazione ed intermediazione nei servizi di telecomunicazione e trasmissione dati. @it
comment: The instances of this class represent, among all business activities, certain telecommunications and brokering activities in telecommunication and data transmission services.
label: Servizi di telecomunicazione @it

Public Administration
type: Class
subclass of: Organization
comment: Comuni, regioni e provincie. @it
comment: Municipalities, regions and provinces.
label: Pubblica Amministrazione @it

Packaging activities
type: Class
subclass of: Utilities and supply
comment: Le istanze di questa classe rappresentano, tra tutte le attività d'impresa, talune attività di imballaggio e confezionamento anche per conto terzi. @it
comment: The instances of this class represent, among all the business activities, some packaging and packaging activities also on behalf of third parties.
label: Imballaggio e confezionamento @it

Paramedical activities
type: Class
subclass of: Health Care
comment: Le istanze di questa classe rappresentano, tra tutte le attività d'impresa, talune attività paramediche indipendenti. @it
comment: The instances of this class represent, among all business activities, certain independent paramedical activities.
label: Attività paramediche @it

Parties and ceremonies
type: Class
subclass of: Shopping and service
comment: Le istanze di questa classe rappresentano, tra tutte le attività d'impresa, talune attività di organizzazione di feste e cerimonie. @it
comment: The instances of this class represent, among all the business activities, certain activities of organizing parties and ceremonies.
label: Organizzazione feste e cerimonie @it

Passenger Air Transport
type: Class
subclass of: Transfer service and renting
comment: Le istanze di questa classe rappresentano, tra tutte le attività d'impresa, talune attività di trasporto aereo. @it
comment: The instances of this class represent, among all business activities, certain aviation activities.
label: Trasporto Aereo @it

Pastry shop
type: Class
subclass of: Wine And Food
comment: Le istanze di questa classe rappresentano, tra tutte le attività d'impresa, talune attività di commercio al dettaglio di torte, dolciumi, confetteria. @it
comment: The instances of this class represent, among all the business activities, certain retail trade activities of cakes, sweets, confectionery.
label: Pasticceria @it

String Service
type: Class
subclass of: Service
comment: Services represented by a polygonal chain.
comment: Servizi rappresentati da una spezzata
label: Servizio con forma lineare @it

pedestrian zone
type: Class
subclass of: Tourism Services
comment: Ciascuna istanza di questa classe rappresenta un'area riservata al transito dei pedoni. @it
comment: Each instance of this class represents an area reserved for pedestrian transit.
label: area pedonale @it

People Counter
type: Class
subclass of: Environment
comment: A device used to count people in the surrounding area.
comment: Un dispositivo utilizzato per contare le persone nell'area circostante. @it
label: Contatore di persone @it

Performing arts schools
type: Class
subclass of: EducationAndResearch
comment: Le istanze di questa classe rappresentano, tra tutte le attività d'impresa, talune attività di istruzione universitaria e post-universitaria, accademie e conservatori. @it
comment: The instances of this class represent, among all business activities, certain university and post-university, academy and conservation activities.
label: Conservatori e accademie @it

Perfumery and Cosmetic Articles
type: Class
subclass of: Shopping and service
comment: Le istanze di questa classe rappresentano, tra tutte le attività d'impresa, talune attività di commercio al dettaglio di cosmetici, di articoli di profumeria, di erboristeria e per l'igiene personale. @it
comment: The instances of this class represent, among all the business activities, certain retail trade activities of cosmetics, perfumery, herbal medicine and personal hygiene.
label: Profumeria Cosmetica @it

Personal and household goods rental
type: Class
subclass of: Utilities and supply
comment: Le istanze di questa classe rappresentano, tra tutte le attività d'impresa, talune attività di noleggio di biancheria da tavola, da letto, da bagno e di articoli di vestiario, oltre altri beni per uso personale e domestico. @it
comment: The instances of this class represent, among all business activities, certain rental activities of table linen, bed linen, bath linen and household linen, in addition to other personal and household goods.
label: Noleggio di beni personali e per la casa @it

Personal service activities
type: Class
subclass of: Shopping and service
comment: Le istanze di questa classe rappresentano, tra tutte le attività d'impresa, taluni servizi per la persona. @it
comment: The instances of this class represent, among all business activities, certain services for the person.
label: Servizi alla persona @it

Pet care services
type: Class
subclass of: Shopping and service
comment: Le istanze di questa classe rappresentano, tra tutte le attività d'impresa, taluni servizi di cura degli animali da compagnia (esclusi i servizi veterinari). @it
comment: The instances of this class represent, among all business activities, certain pet care services (excluding veterinary services).
label: Toilette animali @it

Pet Shop
type: Class
subclass of: Shopping and service
comment: Le istanze di questa classe rappresentano, tra tutte le attività d'impresa, talune attività di commercio al dettaglio di animali domestici (inclusi articoli ed alimenti). @it
comment: The instances of this class represent, among all business activities, certain pet retail activities (including articles and food).
label: Negozio di Animali @it

Petroleum and natural gas extraction
type: Class
subclass of: Mining and quarrying
comment: Le istanze di questa classe rappresentano, tra tutte le attività d'impresa, talune attività di supporto all'estrazione di petrolio e di gas naturale. @it
comment: The instances of this class represent, among all business activities, some activities supporting the extraction of oil and natural gas.
label: Estrazione petrolio e gas natuale @it

Pharmaceuticals
type: Class
subclass of: Shopping and service
comment: Le istanze di questa classe rappresentano, tra tutte le attività d'impresa, talune attività di commercio al dettaglio di medicinali non soggetti a prescrizione medica. @it
comment: The instances of this class represent, among all business activities, certain retail activities of medicinal products not subject to medical prescription.
label: Prodotti Farmaceutici @it

Pharmacy
type: Class
subclass of: Shopping and service
comment: Le istanze di questa classe rappresentano, tra tutte le attività d'impresa, talune attività di farmacia e commercio al dettaglio di medicinali. @it
comment: The demands of this class include, among all business activities, certain pharmacy and retail trade of medicines.
label: Farmacia @it

Photographic activities
type: Class
subclass of: Cultural Activity
comment: Le istanze di questa classe rappresentano, tra tutte le attività d'impresa, talune attività fotografiche, comprese le attività di riprese fotografiche anche aeree, e le attività di sviluppo e stampa svolte in laboratori fotografici. @it
comment: The instances of this class include, among all business activities, certain photographic activities, including photographic and aerial photography activities, and development and printing activities in photographic laboratories.
label: Fotografia e studi fotografici @it

Photovoltaic system
type: Class
subclass of: Environment
comment: Geolocalizzazione degli impianti fotovoltaici funzionanti. @it
comment: Geolocation of working photovoltaic plants.
label: Impianti fotovoltaici @it

Physical therapy centre
type: Class
subclass of: Health Care
comment: Le istanze di questa classe rappresentano, tra tutte le attività d'impresa, talune attività fisioterapiche. @it
comment: The instances of this class represent, among all business activities, some physiotherapy activities.
label: Centri di riabilitazione @it

Pizzeria
type: Class
subclass of: Wine And Food
comment: Le istanze di questa classe rappresentano, tra tutte le attività d'impresa, talune pizzerie. @it
comment: The instances of this class represent, among all the business activities, some pizzerias.

Poison control centre
type: Class
subclass of: Health Care
comment: Le istanze di questa classe rappresentano, tra tutte le sedi di servizi, taluni centri antiveleni. @it
comment: The instances of this class represent, among all service locations, some anti-theft centers.
label: Centro antiveleni @it

Police headquarters
type: Class
subclass of: Government Office
comment: Le istanze di questa classe rappresentano, tra tutte le sedi di servizi, taluni uffici della Questura. @it
comment: The instances of this class represent, among all service locations, certain police headquarters.
label: Questura @it

Pollen observation
type: Class
subclass of: Observation
comment: Ciascuna istanza di questa classe rappresenta una rilevazione degli agenti inquinanti in un determinato luogo e istante di tempo. @it
comment: Each instance of this class represents a pollutant detection at a given time and place.
label: Rilevazione inquinanti @it

Pollen trend observation
type: Class
subclass of: Observation
comment: Ciascuna istanza di questa classe rappresenta un andamento degli agenti inquinanti con riferimento ad un certo luogo ed intervallo temporale. @it
comment: Each instance of this class represents a trend of pollutants with reference to a certain place and time interval.
label: Andamento degli inquinanti @it

Pollen monitoring station
type: Class
subclass of: Environment
comment: Le istanze di questa classe rappresentano ciascuna un rilevatore del livello di allergeni nell'aria. @it
comment: The instances of this class each represent an allergen level detector in the air.
label: Stazione monitoraggio polline @it

Pool
type: Class
subclass of: Entertainment
comment: Le istanze di questa classe rappresentano, tra tutte le attività d'impresa, talune attività di gestione di piscine. @it
comment: The instances of this class represent, among all business activities, some pools management activities.
label: Piscina @it

Port
type: Class
subclass of: Transfer service and renting
comment: Le istanze di questa classe rappresentano, tra tutte le sedi di servizi, taluni porti. @it
comment: The instances of this class represent, among all service locations, certain ports.
label: Porto @it

Post-secondary education
type: Class
subclass of: EducationAndResearch
comment: Le istanze di questa classe rappresentano, tra tutte le attività d'impresa, talune attività di istruzione e formazione tecnica superiore (IFTS). @it
comment: The instances of this class represent, among all business activities, certain technical higher education and training (IFTS) activities.
label: Istruzione e formazione tecnica superiore (IFTS) @it

Postal and Courier Activities
type: Class
subclass of: Transfer service and renting
comment: Le istanze di questa classe rappresentano, tra tutte le attività d'impresa, taluni servizi postali e attività di corriere. @it
comment: The instances of this class represent, among all business activities, certain postal services and courier activities.
label: Poste e Corrieri @it

Postal office
type: Class
subclass of: Government Office
comment: Le istanze di questa classe rappresentano, tra tutte le attività d'impresa, talune attività postali con obbligo di servizio universale (su cui gravano cioè obblighi di legge tesi ad assicurare un livello minimo di servizio a tutta l'utenza interessata, trattandosi di un servizio di pubblico interesse). @it
comment: The instances of this class represent, among all the business activities, certain postal services with universal service obligation (on which, therefore, are legal obligations to ensure a minimum level of service for all users concerned, being a service of public interest).
label: Ufficio postale @it

Pre-primary education
type: Class
subclass of: EducationAndResearch
comment: Le istanze di questa classe rappresentano, tra tutte le attività d'impresa, le attività di istruzione di grado preparatorio: scuole dell'infanzia, scuole speciali collegate a quelle primarie. @it
comment: The instances of this class represent, among all business activities, preparatory education activities: children's schools, special schools linked to primary schools.
label: Scuole dell'infanzia @it

Prefecture
type: Class
subclass of: Government Office
comment: Le istanze di questa classe rappresentano, tra tutte le sedi di servizi, taluni uffici della Prefettura. @it
comment: The instances of this class represent, among all service locations, certain offices of the Prefecture.
label: Prefettura @it

Primary education
type: Class
subclass of: EducationAndResearch
comment: Le istanze di questa classe rappresentano, tra tutte le attività d'impresa, talune attività di istruzione primaria: scuole elementari. @it
comment: The instances of this class represent, among all business activities, certain primary education activities: elementary schools.
label: Scuole elementari @it

Printing and Recorded Media
type: Class
subclass of: Cultural Activity
comment: Le istanze di questa classe rappresentano, tra tutte le attività d'impresa, talune attività di stampa e riproduzione di supporti registrati. @it
comment: The instances of this class represent, among all business activities, some printing and reproduction of recorded media.
label: Stampa e Supporti Registrati @it

Printing and Services
type: Class
subclass of: Cultural Activity
comment: Le istanze di questa classe rappresentano, tra tutte le attività d'impresa, talune attività di stampa, legatoria, lavorazioni preliminari alla stampa e legatoria, servizi connessi con la stampa e legatoria, stampa di giornali. @it
comment: The instances of this class represent, among all the business activities, certain printing and bookbinding activities with related services, and certain newspaper printing activities.
label: Stampa e Servizi @it

Private clinic
type: Class
subclass of: Health Care
comment: Le istanze di questa classe rappresentano, tra tutte le attività d'impresa, talune attività di istituti, cliniche e policlinici universitari, e di ospedali e case di cura generici, specialistici e di lunga degenza. @it
comment: The instances of this class represent, among all business activities, certain private clinics.
label: Clinica privata @it

Private high school
type: Class
subclass of: EducationAndResearch
comment: Le istanze di questa classe rappresentano, tra tutte le sedi di servizi, taluni licei privati. @it
comment: The instances of this class represent, among all service locations, some private high schools.
label: Licei privati @it

Private infant school
type: Class
subclass of: EducationAndResearch
comment: Le istanze di questa classe rappresentano, tra tutte le sedi di servizi, talune scuole materne private. @it
comment: The instances of this class represent, among all service locations, some private infant schools.
label: Scuole materne private @it

Private junior high school
type: Class
subclass of: EducationAndResearch
comment: Le istanze di questa classe rappresentano, tra tutte le sedi di servizi, talune scuole medie private. @it
comment: The instances of this class represent, among all service locations, some private junior high school.
label: Scuole medie private @it

Private junior school
type: Class
subclass of: EducationAndResearch
comment: Le istanze di questa classe rappresentano, tra tutte le sedi di servizi, talune scuole elementari private. @it
comment: The instances of this class represent, among all service locations, some private junior schools.
label: Scuole elementari private @it

Private polytechnic school
type: Class
subclass of: EducationAndResearch
comment: Le istanze di questa classe rappresentano, tra tutte le sedi di servizi, taluni istituti tecnici privati. @it
comment: The instances of this class represent, among all service locations, some private technical institutes.
label: Istituti tecnici privati @it

Private preschool
type: Class
subclass of: EducationAndResearch
comment: Le istanze di questa classe rappresentano, tra tutte le sedi di servizi, taluni nidi privati. @it
comment: The instances of this class represent, among all service locations, certain private nurseries.
label: Nidi privati @it

Private professional institute
type: Class
subclass of: EducationAndResearch
comment: Le istanze di questa classe rappresentano, tra tutte le sedi di servizi, taluni istituti professionali privati. @it
comment: The instances of this class represent, among all service locations, some private professional institutes.
label: Istituti professionali privati @it

Private security
type: Class
subclass of: Utilities and supply
comment: Le istanze di questa classe rappresentano, tra tutte le attività d'impresa, taluni servizi di vigilanza privata. @it
comment: The instances of this class represent, among all business activities, certain private security services.
label: Vigilanza privata @it

Provincial Administration
type: Class
subclass of: Public Administration
comment: Class whose instances are the various provinces.
comment: Classe le cui istanze sono le varie provincie. @it
label: Amministrazione Provinciale @it

Psychologists
type: Class
subclass of: Health Care
comment: Le istanze di questa classe rappresentano, tra tutte le attività d'impresa, talune attività svolte da psicologi. @it
comment: The instances of this class represent, among all the business activities, some activities carried out by psychologists.
label: Psicologi @it

Bus Line
type: Class
subclass of: Transfer service and renting
subclass of: Line
comment: Line of a TPL company
comment: Linea di una certa azienda TPL @it
comment: Service associated with displaying ATAF lines with their stops
comment: Servizio associato alla visualizzazione delle linee ATAF con le relative fermate @it
label: Linea TPL @it
label: Linea bus @it
label: Public Transport Line

Public high school
type: Class
subclass of: EducationAndResearch
comment: Le istanze di questa classe rappresentano, tra tutte le sedi di servizi, taluni licei pubblici. @it
comment: The instances of this class represent, among all service locations, some public high schools.
label: Licei pubblici @it

Public hospital
type: Class
subclass of: Health Care
comment: Le istanze di questa classe rappresentano, tra tutte le sedi di servizi, taluni ospedali pubblici. @it
comment: The instances of this class represent, among all service locations, some public hospitals.
label: Ospedale pubblico @it

Public infant school
type: Class
subclass of: EducationAndResearch
comment: Le istanze di questa classe rappresentano, tra tutte le sedi di servizi, talune scuole materne pubbliche. @it
comment: The instances of this class represent, among all service locations, some public nursery schools.
label: Scuole materne pubbliche @it

Public junior high school
type: Class
subclass of: EducationAndResearch
comment: Le istanze di questa classe rappresentano, tra tutte le sedi di servizi, talune scuole medie pubbliche. @it
comment: The instances of this class represent, among all service locations, some public middle schools.
label: Scuole medie pubbliche @it

Public junior school
type: Class
subclass of: EducationAndResearch
comment: Le istanze di questa classe rappresentano, tra tutte le sedi di servizi, talune scuole elementari pubbliche. @it
comment: The instances of this class represent, among all service locations, some public junior schools.
label: Scuole elementari pubbliche @it

Public polytechnic school
type: Class
subclass of: EducationAndResearch
comment: Le istanze di questa classe rappresentano, tra tutte le sedi di servizi, taluni istituti tecnici pubblici. @it
comment: The instances of this class represent, among all service locations, some public technical institutes.
label: Istituti tecnici pubblici @it

Public professional institute
type: Class
subclass of: EducationAndResearch
comment: Le istanze di questa classe rappresentano, tra tutte le sedi di servizi, taluni istituti professionali pubblici. @it
comment: The instances of this class represent, among all service locations, certain public professional institutes.
label: Istituti professionali pubblici @it

Public relations office
type: Class
subclass of: Government Office
comment: Le istanze di questa classe rappresentano, tra tutte le sedi di servizi, taluni Uffici per le Relazioni con il Pubblico (URP). @it
comment: The instances of this class represent, among all service locations, some Public Relations Offices (URPs).
label: Ufficio relazioni con il pubblico @it

Public university
type: Class
subclass of: EducationAndResearch
comment: Le istanze di questa classe rappresentano, tra tutte le sedi di servizi, talune università pubbliche. @it
comment: The instances of this class represent, among all service locations, some public universities.
label: Universita pubbliche @it

Publishing activities
type: Class
subclass of: Cultural Activity
comment: Le istanze di questa classe rappresentano, tra tutte le attività d'impresa, talune attività di edizione di quotidiani, libri, riviste, periodici ed altre attività editoriali. @it
comment: The instances of this class represent, among all business activities, certain activities of publishing newspapers, books, magazines, periodicals and other editorial activities.
label: Editoria @it

Quality Control and Certification
type: Class
subclass of: Industry and manufacturing
comment: Le istanze di questa classe rappresentano, tra tutte le attività d'impresa, talune attività di controllo di qualità e certificazione di prodotti, processi e sistemi, e talune attività per la tutela di beni di produzione controllata. @it
comment: The instances of this class represent, among all business activities, certain quality control activities and product, process and system certification, and certain activities for the protection of controlled production assets.
label: Certificazione e controllo qualita' @it

Quarrying of stone sand and clay
type: Class
subclass of: Mining and quarrying
comment: Le istanze di questa classe rappresentano, tra tutte le attività d'impresa, talune attività estrattive, ed in particolare: estrazione di ghiaia e sabbia; estrazione di argille e caolino; estrazione di pietre ornamentali e da costruzione, calcare, pietra da gesso, creta e ardesia. @it
comment: The instances of this class represent, among all the business activities, some extractive activities, and in particular: gravel and sand extraction; Extraction of clay and kaolin; Extraction of ornamental and construction stones, limestone, plaster, clay and slate stone.
label: Estrazione di pietra, sabbia e argilla @it

RTZ gate
type: Class
subclass of: Transfer service and renting
comment: Ciascuna istanza di questa classe rappresenta un varco di accesso ad una zona a traffico limitato. @it
comment: Each instance of this class represents a gateway to a restricted traffic zone.
label: Varco ZTL @it

Radio broadcasting
type: Class
subclass of: Cultural Activity
comment: Le istanze di questa classe rappresentano, tra tutte le attività d'impresa, talune attività di trasmissione radiofonica. @it
comment: The instances of this class represent, among all business activities, certain radio broadcasting activities.
label: Emittenti Radio @it

Radiotherapy centre
type: Class
subclass of: Health Care
comment: Le istanze di questa classe rappresentano, tra tutte le sedi di servizi, taluni centri per la radioterapia. @it
comment: The instances of this class represent, among all service locations, some radiotherapy centres.
label: Centro di radioterapia @it

Rafting kayak
type: Class
subclass of: Entertainment
comment: Le istanze di questa classe rappresentano, tra tutte le sedi di servizi, talune sedi dove è possibile praticare rafting, canoa e kayak. @it
comment: The instances of this class represent, among all service locations, some locations where rafting, canoeing and kayaking can be practiced.
label: Rafting canoa e kayak @it

Railway Direction
type: Class
subclass of: Restriction
  on property: Consist of element
  min qualified cardinality: 1
  on class: Railway Element
disjoint with: Railway Element
comment: Class whose instances are the railway directives.
comment: Classe le cui istanze sono le direttive ferroviarie. @it
label: Direttiva Ferroviaria @it

Railway Element
type: Class
subclass of: Feature
subclass of: Edge
subclass of: Restriction
  on property: End at junction
  qualified cardinality: 1
  on class: Railway Junction
subclass of: Restriction
  on property: Start at junction
  qualified cardinality: 1
  on class: Railway Junction
disjoint with: Railway Line
disjoint with: Railway Section
comment: Class whose instances are the elements that make up the sections, sections or rail lines.
comment: Classe le cui istanze sono gli elementi che compongono le tratte, le sezioni o le linee ferroviarie. @it
label: Elemento Ferroviario @it

Railway Junction
type: Class
subclass of: Node
subclass of: SpatialThing
comment: Due giunzioni delimitano un elemento ferroviario e rappresentano stazioni ferroviarie o scali merce. @it
comment: Two junctions delimit a railway element and represent railway stations or freight terminals.
label: Giunzione Ferroviaria @it

Railway Line
type: Class
subclass of: Restriction
  on property: Has element
  min qualified cardinality: 1
  on class: Railway Element
comment: Class whose instances are the railway lines.
comment: Classe le cui istanze sono le linee ferroviarie. @it
label: Linea Ferroviaria @it

Railway Section
type: Class
subclass of: Restriction
  on property: Is composed by element
  min qualified cardinality: 1
  on class: Railway Element
comment: Class whose instances are the railway sections.
comment: Classe le cui istanze sono le sezioni ferroviarie. @it
label: Sezione Ferroviaria @it

Rainfall observation
type: Class
subclass of: Observation
comment: Ciascuna istanza di questa classe rappresenta una rilevazione delle precipitazioni in un certo luogo ed intervallo temporale. @it
comment: Each instance of this class represents a precipitation detection in a certain place and time interval.
label: Rilevazione delle precipitazioni @it

Recreation room
type: Class
subclass of: Entertainment
comment: Le istanze di questa classe rappresentano, tra tutte le sedi di servizi, talune sale gioco. @it
comment: The instances of this class represent, among all the service venues, some recreation rooms.
label: Sala gioco @it

Recreational and Sports Goods rental
type: Class
subclass of: Utilities and supply
comment: Le istanze di questa classe rappresentano, tra tutte le attività d'impresa, talune attività di noleggio di attrezzature sportive e ricreative, comprese le imbarcazioni da diporto ed in particolare i pedalò. @it
comment: The instances of this class represent, among all business activities, some rental activities of sports and recreational equipment, including pleasure boats and in particular pedalos.
label: Noleggio attrezzature sportive e ricreative @it

Recruitment
type: Class
subclass of: Utilities and supply
comment: Le istanze di questa classe rappresentano, tra tutte le attività d'impresa, taluni servizi di ricerca, selezione, collocamento, gestione e supporto per il ricollocamento di personale. @it
comment: The instances of this class represent, among all business activities, certain research, selection, placement, management and support services for staff relocation.
label: Ricerca e Selezione personale @it

Red cross
type: Class
subclass of: Health Care
comment: Le istanze di questa classe rappresentano, tra tutte le sedi di servizi, talune sedi della Croce Rossa. @it
comment: The instances of this class represent, among all service locations, certain Red Cross seats.
label: Croce rossa @it

Regional Administration
type: Class
subclass of: Public Administration
comment: Class whose instances are the various regions.
comment: Classe le cui istanze sono le varie regioni. @it
label: Amministrazione Regionale @it

Regular Service
type: Class
subclass of: Service
comment: Services that may have other features, represented as cross services.
comment: Servizi che possono avere altre caratteristiche, rappresentate come servizi trasversali. @it
label: Servizio Regolare @it

Religious guest house
type: Class
subclass of: Accommodation
comment: Le istanze di questa classe rappresentano, tra tutte le sedi di servizi, taluni alloggi per ferie gestiti da ordini monastici. @it
comment: The instances of this class represent, among all service locations, certain holiday homes operated by monastic orders.
label: Casa per ferie @it

Repair
type: Class
subclass of: Shopping and service
comment: Le istanze di questa classe rappresentano, tra tutte le attività d'impresa, taluni servizi di riparazioni rapide, duplicazione chiavi, affilatura coltelli, stampa immediata su articoli tessili, incisioni rapide su metallo non prezioso, riparazione di articoli di vestiario non effettuate in sartorie e riparazione di altri articoli di consumo per uso personale e per la casa. @it
comment: The instances of this class represent, among all the business activities, some quick repair services, key duplication, sharpening knives, immediate printing on textile articles, quick metal engraving, non-precious metal repair items, and Repair of other articles of consumption for personal use and for the house.
label: Riparazioni @it

Repair musical instruments
type: Class
subclass of: Shopping and service
comment: Le istanze di questa classe rappresentano, tra tutte le attività d'impresa, taluni servizi di riparazione di strumenti musicali. @it
comment: The instances of this class represent, among all the business activities, some musical instruments repair services.
label: Riparazione strumenti musicali @it

Repair of communication equipment
type: Class
subclass of: Shopping and service
comment: Le istanze di questa classe rappresentano, tra tutte le attività d'impresa, taluni servizi di riparazione e manutenzione di telefoni fissi, cordless, cellulari ed altre apparecchiature per la telecomunicazione. @it
comment: The instances of this class represent, among all business activities, certain repair and maintenance services for fixed, cordless, cellular and other telecommunication equipment.
label: Riparazione telefoni, cellulari, fax @it

Repair of consumer electronics
type: Class
subclass of: Shopping and service
comment: Le istanze di questa classe rappresentano, tra tutte le attività d'impresa, taluni servizi di riparazione di prodotti elettronici di consumo audio e video per uso personale e per la casa. @it
comment: The instances of this class represent, among all business activities, some repair services for consumer electronics and audio and video products for personal and home use.
label: Riparazione Tv, video e audio @it

Repair of footwear and leather goods
type: Class
subclass of: Shopping and service
comment: Le istanze di questa classe rappresentano, tra tutte le attività d'impresa, taluni servizi di riparazione di calzature e articoli da viaggio in pelle, cuoio o in altri materiali simili. @it
comment: The instances of this class represent, among all business activities, certain repair services for footwear and luggage in leather, leather or similar materials.
label: Riparazione calzature e articolo da viaggio @it

Repair of garden equipment
type: Class
subclass of: Shopping and service
comment: Le istanze di questa classe rappresentano, tra tutte le attività d'impresa, taluni servizi di riparazione di articoli per il giardinaggio. @it
comment: The instances of this class represent, among all business activities, certain gardening repair services.
label: Riparazione articoli giardinaggio @it

Repair of home equipment
type: Class
subclass of: Shopping and service
comment: Le istanze di questa classe rappresentano, tra tutte le attività d'impresa, taluni servizi di riparazione di altri beni per uso personale e per la casa. @it
comment: The instances of this class represent, among all business activities, certain repair services of other goods for personal and home use.
label: Riparazione articoli per la casa @it

Repair of household appliances
type: Class
subclass of: Shopping and service
comment: Le istanze di questa classe rappresentano, tra tutte le attività d'impresa, taluni servizi di riparazione di elettrodomestici e di articoli per la casa. @it
comment: The instances of this class represent, among all the business activities, some repair services of household appliances and household items.
label: Riparazione elettrodomestici @it

Repair of sporting goods
type: Class
subclass of: Shopping and service
comment: Le istanze di questa classe rappresentano, tra tutte le attività d'impresa, taluni servizi di riparazione di articoli sportivi (escluse le armi sportive) e attrezzature da campeggio (incluse le biciclette). @it
comment: The instances of this class represent, among all business activities, certain repair services for sporting goods (excluding sportswear) and camping equipment (including bicycles).
label: Riparazione articoli sportivi e da campeggio @it

Reporting agencies
type: Class
subclass of: Utilities and supply
comment: Le istanze di questa classe rappresentano, tra tutte le attività d'impresa, talune agenzie di informazioni commerciali. @it
comment: The instances of this class represent, among all business activities, certain commercial information agencies.
label: Agenzie di informazioni commerciali @it

Reproduction Recorded Media
type: Class
subclass of: Cultural Activity
comment: Le istanze di questa classe rappresentano, tra tutte le attività d'impresa, talune attività di riproduzione di supporti registrati. @it
comment: The instances of this class represent, among all business activities, certain activities of reproduction of recorded media.
label: Riproduzione Supporti Registrati @it

Rescuers area
type: Class
subclass of: Emergency
comment: Ciascuna istanza di questa classe rappresenta un punto di ritrovo dei soccorritori in caso di calamità. @it
comment: Each instance of this class represents a meeting point for rescuers in case of disaster.
label: Aree ammassamento soccorritori @it

Research and development
type: Class
subclass of: EducationAndResearch
comment: Le istanze di questa classe rappresentano, tra tutte le attività d'impresa, talune attività di ricerca scientifica e di ricerca e sviluppo sperimentale nei campi della geologia, scienze naturali, ingegneria, biotecnologie, scienze sociali e umanistiche. @it
comment: The instances of this class represent, among all the business activities, certain scientific research and research and experimental development activities in the fields of geology, natural sciences, engineering, biotechnology, social sciences and humanities.
label: Ricerca e Sviluppo @it

Reserved lane
type: Class
subclass of: Transfer service and renting
comment: Ciascuna istanza di questa classe rappresenta una corsia riservata ad una specifica tipologia di utenza. @it
comment: Each instance of this class represents a lane reserved for a specific type of user.
label: Corsia riservata @it

Residence
type: Class
subclass of: Accommodation
comment: Le istanze di questa classe rappresentano, tra tutte le sedi di servizi, taluni residence. @it
comment: The instances of this class represent, among all service locations, some residences.

Residential care activities
type: Class
subclass of: Health Care
comment: Le istanze di questa classe rappresentano, tra tutte le attività d'impresa, talune strutture di assistenza residenziale per anziani, disabili motori, persone affette da ritardi mentali, disturbi mentali o che abusano di sostanze stupefacenti. @it
comment: The demands of this class include, among all business activities, certain residential care facilities for the elderly, disabled motorists, people with mental retardation, mental disorders, or abusing drugs.
label: Assistenza residenziale @it

Resolution
type: Class
comment: Delibera approvata da un Ente Pubblico. @it
comment: Resolution approved by a Public Administration.
label: Delibera @it

Rest home
type: Class
subclass of: Accommodation
comment: Le istanze di questa classe rappresentano, tra tutte le sedi di servizi, talune case di riposo. @it
comment: The instances of this class represent, among all service locations, some rest homes.
label: Casa di riposo @it

Restaurant
type: Class
subclass of: Wine And Food
comment: Le istanze di questa classe rappresentano, tra tutte le attività d'impresa, taluni servizi di ristorazione anche con somministrazione eventualmente connessi con le aziende agricole, e taluni servizi di ristorazione su treni, navi, e di ristorazione mobile in genere. @it
comment: The instances of this class represent, among all business activities, certain catering services in a fixed location (including farmhouses), and all mobile catering services on trains, ships and others.
label: Ristorante @it

Restorers
type: Class
subclass of: Shopping and service
comment: Le istanze di questa classe rappresentano, tra tutte le attività d'impresa, talune attività di conservazione e restauro di opere d'arte. @it
comment: The instances of this class represent, among all the business activities, some conservation and restoration works of art.
label: Restauratori @it

Restriction
type: Class
comment: Le istanze di questa classe rappresentano ciascuna una restrizione che si applica al traffico veicolare. @it
comment: The instances of this class represent each a restriction that applies to the transit of vehicles.
label: Restrizioni @it

Retail Motor Vehicles Parts
type: Class
subclass of: Shopping and service
comment: Le istanze di questa classe rappresentano, tra tutte le attività d'impresa, talune attività di commercio di parti e accessori di motoveicoli e di intermediazione nel commercio delle parti e degli accessori di motoveicoli. @it
comment: The instances of this class represent, among all the business activities, certain trade in parts and accessories of motor vehicles and brokering in the trade of motorcycle parts and accessories.
label: Vendita Dettaglio Ricambi Autoveicoli @it

Retail Sale Non-Specialized Stores
type: Class
subclass of: Shopping and service
comment: Le istanze di questa classe rappresentano, tra tutte le attività d'impresa, talune attività di commercio al dettaglio in esercizi non specializzati, anche con prevalenza di prodotti alimentari e bevande. @it
comment: The instances of this class represent, among all business activities, certain retail activities in non-specialized businesses, including prevalence of food and beverages.
label: Vendita Dettaglio Esercizi Non Specializzati @it

Retail Trade
type: Class
subclass of: Shopping and service
comment: Le istanze di questa classe rappresentano, tra tutte le attività d'impresa, talune attività di commercio al dettaglio. @it
comment: The instances of this class represent, among all business activities, certain retail activities.
label: Vendita Dettaglio @it

Ride
type: Class
subclass of: Restriction
  on property: Scheduled on line
  qualified cardinality: 1
  on class: Bus Line
disjoint with: Route
comment: Corsa programmata da una certa azienda TPL su un certo percorso di una certa linea. @it
comment: Run scheduled by a certain TPL company on a certain route of a certain line.
label: Corsa @it

Riding stables
type: Class
subclass of: Entertainment
comment: Le istanze di questa classe rappresentano, tra tutte le sedi di servizi, talune attività di maneggio. @it
comment: The instances of this class represent, among all service locations, some riding stables activities.
label: Maneggi @it

Road
type: Class
subclass of: Road
disjoint with: Road element
comment: Class whose instances are the streets.
comment: Classe le cui istanze sono le strade. @it
label: Strada @it

Road element
type: Class
subclass of: Edge
subclass of: Road_Element
subclass of: Restriction
  on property: Ends at node
  qualified cardinality: 1
  on class: Node
subclass of: Restriction
  on property: Starts at node
  qualified cardinality: 1
  on class: Node
comment: Class whose instances are the elements that make up the streets.
comment: Classe le cui istanze sono gli elementi che compongono le strade. @it
label: Elemento Stradale @it

RoadLink
type: Class
subclass of: Edge
subclass of: Restriction
  on property: Ending junction
  qualified cardinality: 1
  on class: Junction
subclass of: Restriction
  on property: Starting junction
  qualified cardinality: 1
  on class: Junction
comment: Linear road section bounded by two junctions that make up the road element.
comment: Tratto di strada lineare delimitato da due giunzioni che compone il road element. @it
label: tratto di strada lineare @it

Roman bridge
type: Class
subclass of: Cultural Activity
comment: Le istanze di questa classe rappresentano i ponti romani. @it
comment: The instances of this class represent the Roman bridges.
label: Ponte romano @it

Rope cord and twine
type: Class
subclass of: Shopping and service
comment: Le istanze di questa classe rappresentano, tra tutte le attività d'impresa, talune attività di commercio al dettaglio di spaghi, cordami, tele e sacchi di juta e prodotti per l'imballaggio (esclusi quelli in carta e cartone). @it
comment: The instances of this class represent, among all business activities, certain retail activities of spades, ropes, canvases and jute bags and packaging products (excluding paper and board products).
label: Corde, funi e sacchi @it

Route
type: Class
subclass of: Route
subclass of: Restriction
  on property: Has section
  min cardinality: 1
subclass of: Restriction
  on property: Has first section
  qualified cardinality: 1
  on class: Route Section
subclass of: Restriction
  on property: Has first stop
  qualified cardinality: 1
  on class: Bus Stop
comment: A route that is driven by public transport.
comment: Percorso che percorre un mezzo di trasporto pubblico. @it
label: Percorso @it

Route Junction
type: Class
subclass of: Node
subclass of: SpatialThing
comment: Interconnection point between road segments to determine the path of a TPL line.
comment: Punto di interconnessione tra segmenti di strada per determinare il percorso di una linea di TPL. @it
label: giunzione dei percorsi @it

RouteLink
type: Class
subclass of: Edge
subclass of: Restriction
  on property: Begins at junction
  qualified cardinality: 1
  on class: Route Junction
subclass of: Restriction
  on property: Finishes at junction
  qualified cardinality: 1
  on class: Route Junction
comment: Road section bounded by two TPL junction that determines the path of a TPL line.
comment: Tratto di strada delimitato da due TPL junction che determina il percorso di una linea TPL. @it
label: strada di collegamento @it

Route Section
type: Class
subclass of: RouteSection
subclass of: Restriction
  on property: Ends at stop
  qualified cardinality: 1
  on class: Bus Stop
subclass of: Restriction
  on property: Start at stop
  qualified cardinality: 1
  on class: Bus Stop
comment: Road section between two successive bus stops in a certain line.
comment: Tratto di strada compreso tra due successive fermate dell'autobus di una certa linea. @it
label: Sezione di percorso @it

Restricted traffic zone daily
type: Class
subclass of: Transfer service and renting
comment: Ciascuna istanza di questa classe rappresenta una zona a traffico limitato attiva nelle sole ore diurne. @it
comment: Each instance of this class represents a limited active zone in the only daylight hours.
label: Zona a traffico limitato diurno @it

Restricted traffic zone nightly
type: Class
subclass of: Transfer service and renting
comment: Ciascuna istanza di questa classe rappresenta una zona a traffico limitato attiva nelle sole ore notturne. @it
comment: Each instance of this class represents a limited traffic zone active only in the nocturnal hours.
label: Zona a traffico limitato notturno @it

STOMP Broker
type: Class
subclass of: Message Broker
subclass of: Restriction
  on property: STOMP Destination
  min qualified cardinality: 1
  on data range: string
comment: It represents a hardware/software component that acts as an interface between a device or a set of devices (sensors, actuators) and the external, implementing the STOMP protocol.
comment: Modella un componente hardware/software che agisce da interfaccia tra un dispositivo o un insieme di dispositivi (sensori, attuatori) e il mondo esterno implementando il protocollo STOMP. @it
label: Broker STOMP @it

Sailing school
type: Class
subclass of: EducationAndResearch
comment: Le istanze di questa classe rappresentano, tra tutte le sedi di servizi, talune scuole di vela. @it
comment: The instances of this class represent, among all service locations, some sailing schools.
label: Scuola di vela @it

Sale Motor Vehicles Parts
type: Class
subclass of: Shopping and service
comment: Le istanze di questa classe rappresentano, tra tutte le attività d'impresa, talune attività di commercio di parti e accessori di autoveicoli. @it
comment: The instances of this class represent, among all the business activities, certain trade in parts and accessories of motor vehicles.
label: Vendita Ricambi Autoveicoli @it

Sale of Motor Vehicles
type: Class
subclass of: Shopping and service
comment: Le istanze di questa classe rappresentano, tra tutte le attività d'impresa, talune attività di commercio di autoveicoli. @it
comment: The instances of this class represent, among all the business activities, certain car trade activities.
label: Vendita Autoveicoli @it

Sale of Motor Vehicles and Motorcycles
type: Class
subclass of: Shopping and service
comment: Le istanze di questa classe rappresentano, tra tutte le attività d'impresa, talune attività di commercio all'ingrosso e al dettaglio e riparazione di autoveicoli e motocicli. @it
comment: The instances of this class represent, among all business activities, certain wholesale and retail activities and repair of motor vehicles and motorcycles.
label: Vendita Autoveicoli Motocicli @it

Sale of Motorcycles
type: Class
subclass of: Shopping and service
comment: Le istanze di questa classe rappresentano, tra tutte le attività d'impresa, talune attività di commercio, manutenzione e riparazione di motocicli e relative parti ed accessori. @it
comment: The instances of this class represent, among all the business activities, certain activities of trade, maintenance and repair of motorcycles and related parts and accessories.
label: Vendita Motocicli @it

Sale Via Mail Order Houses or Via Internet
type: Class
subclass of: Shopping and service
comment: Le istanze di questa classe rappresentano, tra tutte le attività d'impresa, talune attività di commercio al dettaglio di qualsiasi tipo di prodotto per corrispondenza, radio, telefono, Internet. @it
comment: The instances of this class represent, among all business activities, certain retail activities of any type of correspondence, radio, telephone, Internet product.
label: Vendita per Corrispondenza o via Internet @it

Sandwich shop pub
type: Class
subclass of: Wine And Food
comment: Le istanze di questa classe rappresentano, tra tutte le attività d'impresa, talune paninoteche e pub. @it
comment: The instances of this class represent, among all business activities, some sandwich shops and pubs.
label: Paninoteche pubs @it

Sanitary Equipment
type: Class
subclass of: Shopping and service
comment: Le istanze di questa classe rappresentano, tra tutte le attività d'impresa, talune attività di commercio al dettaglio di articoli igienico-sanitari. @it
comment: The instances of this class represent, among all the business activities, certain retail activities of sanitary articles.
label: Articoli Igienico-Sanitari @it

Sawmilling
type: Class
subclass of: Industry and manufacturing
comment: Le istanze di questa classe rappresentano, tra tutte le attività d'impresa, talune attività di taglio e piallatura del legno. @it
comment: The instances of this class represent, among all the business activities, some wood cutting and planing activities.
label: Segherie @it

Description of a bounded environment
type: Class
subclass of: High level type
comment: Descrition of a bounded environment in space and time.
comment: Descrizione di un ambiente delimitato nello spazio e nel tempo. @it
label: Descrizione di un ambiente delimitato @it

School Observation
type: Class
subclass of: Observation
comment: Ciascuna istanza di questa classe rappresenta un'osservazione scolastica. @it
comment: Each instance of this class represents a school observation.
label: Osservazione scolastica @it

School canteen
type: Class
subclass of: EducationAndResearch
comment: Le istanze di questa classe rappresentano, tra tutte le sedi di servizi, talune mense scolastiche. @it
comment: The instances of this class represent, among all service locations, some school canteens.
label: Mensa scolastica @it

Second-Hand Books
type: Class
subclass of: Shopping and service
comment: Le istanze di questa classe rappresentano, tra tutte le attività d'impresa, talune attività di commercio al dettaglio di articoli e libri di seconda mano. @it
comment: The instances of this class represent, among all the business activities, certain retail activities of second hand articles and books.
label: Libri Usati @it

Second-Hand Goods
type: Class
subclass of: Shopping and service
comment: Le istanze di questa classe rappresentano, tra tutte le attività d'impresa, talune attività di commercio al dettaglio di articoli ed indumenti di seconda mano. @it
comment: The instances of this class represent, among all business activities, certain retail activities of second hand items and clothing.
label: Articoli Usati @it

Secondary education
type: Class
subclass of: EducationAndResearch
comment: Le istanze di questa classe rappresentano, tra tutte le attività d'impresa, talune attività di istruzione secondaria di primo e secondo grado di formazione generale (licei), tecnica, professionale e artistica. @it
comment: The instances of this class represent, among all business activities, secondary education of first and second grade general (high school), technical, vocational and artistic education.
label: Scuole medie, licei e istituti tecnici @it

Secretarial support services
type: Class
subclass of: Utilities and supply
comment: Le istanze di questa classe rappresentano, tra tutte le attività d'impresa, taluni servizi di fotocopiatura, preparazione di documenti e altre attività di supporto specializzate per le funzioni d'ufficio, e talune attività di spedizione di materiale propagandistico, compilazione e gestione di indirizzi. @it
comment: The instances of this class represent, among all business activities, certain photocopying, document preparation and other specialized support activities for office functions, and certain activities for the dispatch of propaganda material, compilation and address management .
label: Supporto di segreteria @it

Security systems
type: Class
subclass of: Shopping and service
comment: Le istanze di questa classe rappresentano, tra tutte le attività d'impresa, talune attività di commercio al dettaglio di sistemi di sicurezza. @it
comment: The instances of this class represent, among all business activities, certain retail trade activities of security systems.
label: Allarmi e sistemi di sicurezza @it

Security systems service
type: Class
subclass of: Utilities and supply
comment: Le istanze di questa classe rappresentano, tra tutte le attività d'impresa, talune attività di commercio al dettaglio di sistemi di sicurezza. @it
comment: The instances of this class represent, among all business activities, certain retail trade activities of security systems.
label: Sistemi di sicurezza @it

Senior centre
type: Class
subclass of: Health Care
comment: Le istanze di questa classe rappresentano, tra tutte le sedi di servizi, taluni ricoveri per anziani. @it
comment: The instances of this class represent, among all the places of service, some old-age hospitals.
label: Ricoveri @it

Traffic sensor
type: Class
subclass of: Transfer service and renting
subclass of: SpatialThing
comment: Sensore stradale che rilascia info sul traffico @it
comment: Single sensor for observing speed, traffic, concentration or density
comment: Singolo sensore per osservare velocità, traffico, concentrazione o densità @it
comment: Traffic sensor releasing traffic info
label: Sensori del traffico @it

Sensor Site Table
type: Class
comment: Insieme di sensori che rappresentano un unica installazione, un unico sito. @it
comment: Set of sensors representing a single installation, a single site.
label: Tabella di sensori @it

Service
type: Class
subclass of: Feature
subclass of: Service
subclass of: SpatialThing
comment: Attività commerciali, servizi al cittadino, uffici, servizi in genere, che possono essere localizzati in un punto. @it
comment: Business activities, services to the citizen, offices, services in general, which can be located at one point.
label: Servizio @it

Sewerage
type: Class
subclass of: Environment
comment: Le istanze di questa classe rappresentano, tra tutte le attività d'impresa, talune società di gestione della rete fognaria. @it
comment: The instances of this class represent, among all business activities, certain sewerage companies.
label: Rete Fognaria @it

Sexy Shop
type: Class
subclass of: Shopping and service
comment: Le istanze di questa classe rappresentano, tra tutte le attività d'impresa, talune attività di commercio al dettaglio di articoli per adulti (sexy shop). @it
comment: The instances of this class represent, among all the business activities, some retail business of adult articles (sexy shop).

Shelter area
type: Class
subclass of: Emergency
comment: Ciascuna istanza di questa classe rappresenta un punto di raccolta della popolazione in caso di calamità.
comment: Each instance of this class represents a population gathering point in case of disaster.
label: Area ricovero popolazione @it

Shopping and service
type: Class
subclass of: Service
comment: Negozi, centri commerciali, spacci, ogni forma di attività di vendita al pubblico. @it
comment: Shops, malls, stores, all forms of public sale activities.
label: Shopping e servizi @it

Shopping centre
type: Class
subclass of: Shopping and service
comment: Le istanze di questa classe rappresentano, tra tutte le attività d'impresa, taluni grandi magazzini. @it
comment: The instances of this class represent, among all business activities, some department stores.
label: Centri Commerciali @it

Single brand store
type: Class
subclass of: Shopping and service
comment: Le istanze di questa classe rappresentano, tra tutte le sedi di servizi, taluni negozi mono-marca. @it
comment: The instances of this class represent, among all service locations, some single-brand stores.
label: Negozi monomarca @it

Situation Record of a Car Park
type: Class
subclass of: Restriction
  on property: Related to sensor
  qualified cardinality: 1
  on class: Car Park Sensor
comment: Recording the situation of a given parking lot at a certain time.
comment: Registrazione della situazione di occupazione di un determinato parcheggio in un certo istante. @it
label: Situazione di un parcheggio @it

Ski school
type: Class
subclass of: EducationAndResearch
comment: Le istanze di questa classe rappresentano, tra tutte le sedi di servizi, talune scuole di sci. @it
comment: The instances of this class represent, among all the service centers, some ski schools.
label: Scuola di sci @it

Skiing facility
type: Class
subclass of: Entertainment
comment: Le istanze di questa classe rappresentano, tra tutte le sedi di servizi, taluni impianti sciistici. @it
comment: The instances of this class represent, amongst all service locations, some skiing facilties.
label: Impianti sciistici @it

Small Household Appliances
type: Class
subclass of: Shopping and service
comment: Le istanze di questa classe rappresentano, tra tutte le attività d'impresa, talune attività di commercio al dettaglio di macchine per cucire e per maglieria per uso domestico. @it
comment: The instances of this class represent, among all the business activities, some retail business of sewing machines and household knitwear.
label: Piccoli Elettrodomestici @it

Small shop
type: Class
subclass of: Wine And Food
comment: Le istanze di questa classe rappresentano, tra tutte le attività d'impresa, talune botteghe di generi alimentari. @it
comment: The instances of this class represent, among all business activities, some grocery stores.
label: Bottega @it

Smart bench observation
type: Class
subclass of: Observation
comment: Ciascuna istanza di questa classe rappresenta una rilevazione proveniente da una panchina dotata di funzionalità evolute. @it
comment: Each instance of this class represents a detection from a bench equipped with advanced features.
label: Rilevazione da panchina intelligente @it

Smart irrigator observation
type: Class
subclass of: Observation
comment: Ciascuna istanza di questa classe rappresenta una rilevazione proveniente da un irrigatore dotato di funzionalità evolute. @it
comment: Each instance of this class represents a detection from a sprinkler equipped with advanced features.
label: Rilevazione da irrigatore intelligente @it

Smart waste container observation
type: Class
subclass of: Observation
comment: Ciascuna istanza di questa classe rappresenta una rilevazione proveniente da un contenitore dei rifiuti dotato di funzionalità evolute. @it
comment: Each instance of this class represents a detection from a waste container with advanced features.
label: Rilevazione da contenitore di rifiuti intelligente @it

Smart bench
type: Class
subclass of: Bench
subclass of: Entertainment
comment: Ciascuna istanza di questa classe rappresenta una panchina dotata di funzionalità evolute.
comment: Each instance of this class represents a bench equipped with advanced features.
label: Panchina intelligente @it

Smart irrigator
type: Class
subclass of: Environment
subclass of: Irrigator
comment: Ciascuna istanza di questa classe rappresenta un irrigatore dotato di funzionalità avanzate. @it
comment: Each instance of this class represents an irrigator with advanced features.
label: Irrigatore intelligente @it

Smart street light
type: Class
subclass of: Environment
subclass of: Street light
comment: Ciascuna istanza di questa classe rappresenta un lampione del sistema di illuminazione stradale dotato di funzionalità avanzate. @it
comment: Each instance of this class represents a street lamp with advanced features.
label: Lampione stradale intelligente @it

Smart waste container
type: Class
subclass of: Environment
subclass of: Waste container
comment: Ciascuna istanza di questa classe rappresenta un cassonetto per l'immondizia dotato di funzionalità avanzate. @it
comment: Each instance of this class represents a garbage dump with advanced features.
label: Cassonetto intelligente @it

Social centre
type: Class
subclass of: Entertainment
comment: Le istanze di questa classe rappresentano, tra tutte le sedi di servizi, taluni centri sociali. @it
comment: The instances of this class represent, among all service locations, some social centers.
label: Centro sociale @it

Social security service office
type: Class
subclass of: Government Office
comment: Le istanze di questa classe rappresentano, tra tutte le sedi di servizi, taluni uffici dell'Istituto Nazionale di Previdenza Sociale. @it
comment: The instances of this class represent, among all service locations, certain offices of the National Institute of Social Security.
label: Ufficio INPS @it

Social work
type: Class
subclass of: Health Care
comment: Le istanze di questa classe rappresentano, tra tutte le attività d'impresa, taluni servizi di asilo nido, assistenza diurna per minori disabili e attività di assistenza sociale residenziale e non residenziale per anziani e disabili. @it
comment: The demands of this class include, among all business activities, certain nursery services, day care for disabled children and residential and non-residential social services for the elderly and disabled.
label: Assistenza sociale @it

Software publishing
type: Class
subclass of: Industry and manufacturing
comment: Le istanze di questa classe rappresentano, tra tutte le attività d'impresa, talune attività di edizione di giochi per computer e software. @it
comment: The instances of this class represent, among all the business activities, some computer and software play activities.
label: Editoria Software @it

Sound Recording and Music Publishing
type: Class
subclass of: Cultural Activity
comment: Le istanze di questa classe rappresentano, tra tutte le attività d'impresa, talune attività di registrazione sonora e di editoria musicale anche in studi di registrazione sonora. @it
comment: The instances of this class include, among all the business activities, some sound recording and music publishing activities also in sound recording studios.
label: Registrazione sonora e editoria musicale @it

Souvenirs Craftwork and Religious Articles
type: Class
subclass of: Shopping and service
comment: Le istanze di questa classe rappresentano, tra tutte le attività d'impresa, talune attività di commercio al dettaglio di oggetti d'arte di culto e di decorazione, chincaglieria, bigiotteria e oggetti d'artigianato. @it
comment: The instances of this class represent, among all the business activities, certain retail trade activities of worship and decoration art, trinkets, costume jewelery and handicrafts.
label: Souvenir Artigianato e Articoli Religiosi @it

Specialized Construction
type: Class
subclass of: Civil and edil engineering
comment: Le istanze di questa classe rappresentano, tra tutte le attività d'impresa, talune attività specializzate di costruzione, tra cui ad esempio:installazione impianti di illuminazione stradale e dispositivi elettrici di segnalazione, illuminazione delle piste degli aeroporti (inclusa manutenzione e riparazione); installazione di impianti di depurazione per piscine (inclusa manutenzione e riparazione); installazione di impianti di irrigazione per giardini (inclusa manutenzione e riparazione); trivellazioni e perforazioni; lavori di isolamento termico, acustico o antivibrazioni; installazione di impianti elettronici (inclusa manutenzione e riparazione); installazione di impianti elettrici in edifici o in altre opere di costruzione (inclusa manutenzione e riparazione); tinteggiatura e posa in opera di vetri; installazione di impianti idraulici, di riscaldamento e di condizionamento dell'aria (inclusa manutenzione e riparazione) in edifici o in altre opere di costruzione; posa in opera di casseforti ed infissi; completamento e finitura di edifici;demolizione di edifici; posa in opera di infissi, arredi, controsoffitti, pareti mobili e simili; rivestimento di pavimenti e di muri; preparazione del cantiere edile e sistemazione del terreno; intonacatura e stuccatura; installazione di impianti per la distribuzione del gas (inclusa manutenzione e riparazione); installazione di impianti di spegnimento antincendio, compresi quelli integrati (inclusa manutenzione e riparazione); installazione, riparazione e manutenzione di ascensori e scale mobili. @it
comment: The instances of this class represent, among all the business activities, certain specialized construction activities, such as: installation of street lighting and signaling devices, illumination of the slopes of airports (including maintenance and repair); installation of sewage treatment plants for swimming pools (including maintenance and repair); Installation of irrigation systems for gardens (including maintenance and repair); drilling and perforation; works of thermal, acoustic or anti-vibration insulation; installation of electronic equipment (including maintenance and repair); installation of electrical installations in buildings or in other works of building (included maintenance and repair); tinteggiatura and pose in work of glasses; Installation of plumbing, heating and air conditioning (including maintenance and repair) in buildings or in other works of construction; poses in work of casseforti and infissi; completion and finishing of buildings; demolition of buildings; poses in work of infissi, furnitures, controsoffitti, mobile and alike walls; covering of floors and walls; preparation of the yard building and placing of the terrain; plastering and plastering; installation of gas distribution facilities (including maintenance and repair); installation of fire extinguishing systems, including integrated ones (including maintenance and repair); installation, repair and maintenance of elevators and escalators.
label: Lavori Costruzione Specializzati @it

Specialized Design
type: Class
subclass of: Industry and manufacturing
comment: Le istanze di questa classe rappresentano, tra tutte le attività d'impresa, talune attività di progettazione tra cui: talune attività professionali, scientifiche e tecniche; talune attività di design anche specializzate; attività di design di moda e industriale; attività dei disegnatori tecnici; attività di grafica pubblicitaria e di disegno grafico, anche di pagine Web. @it
comment: The instances of this class represent, among all business activities, certain design activities including: some professional, scientific and technical activities; certain specialized design activities; fashion and industrial design activities; activities of technical designers; graphics and graphic design, including Web pages.
label: Grafici e disegnatori @it

Speed camera
type: Class
subclass of: Transfer service and renting
comment: Le istanze di questa classe rappresentano ciascuna un autovelox. @it
comment: The instances of this class are each a speedcam.
label: Autovelox @it

Sport event promoters
type: Class
subclass of: Entertainment
comment: Le istanze di questa classe rappresentano, tra tutte le attività d'impresa, talune attività di enti e organizzazioni sportive, anche di promozione di eventi sportivi. @it
comment: The instances of this class represent, among all the business activities, certain activities of sports organizations, including the promotion of sporting events.
label: Organizzazione eventi sportivi @it

Sporting Equipment
type: Class
subclass of: Shopping and service
comment: Le istanze di questa classe rappresentano, tra tutte le attività d'impresa, talune attività di commercio al dettaglio di articoli sportivi, biciclette, articoli per il tempo libero e per le attività subacquee. @it
comment: The instances of this class represent, among all business activities, certain retail activities of sporting goods, bicycles, leisure articles and underwater activities.
label: Articoli Sportivi @it

Sports and recreation education
type: Class
subclass of: EducationAndResearch
comment: Le istanze di questa classe rappresentano, tra tutte le attività d'impresa, talune attività di organizzazione di corsi sportivi e ricreativi. @it
comment: The instances of this class represent, among all the business activities, some activities of organizing sports and recreational courses.
label: Corsi sportivi e ricreativi @it

Sports clubs
type: Class
subclass of: Entertainment
comment: Le istanze di questa classe rappresentano, tra tutte le attività d'impresa, talune attività di club sportivi. @it
comment: The instances of this class represent, among all the business activities, some activities of sports clubs.
label: Societa' sportive @it

Sports facility
type: Class
subclass of: Entertainment
comment: Le istanze di questa classe rappresentano, tra tutte le attività d'impresa, talune attività di gestione di impianti sportivi ed altre attività sportive. @it
comment: The instances of this class represent, among all the business activities, some sports facilities management activities.
label: Impianti sportivi @it

Squares
type: Class
subclass of: Cultural Activity
comment: Le istanze di questa classe rappresentano, tra tutte le sedi di servizi, talune piazze di interesse per lo svolgimento di attività culturali. @it
comment: The instances of this class represent, among all the places of service, some squares of interest to carry out cultural activities.
label: Piazze @it

Stalls and Markets
type: Class
subclass of: Shopping and service
comment: Le istanze di questa classe rappresentano, tra tutte le attività d'impresa, talune attività di commercio al dettaglio ambulante. @it
comment: The instances of this class represent, among all business activities, certain street retailing business activities.
label: Vendita Ambulante @it

Stalls and Markets of Clothing and Footwear
type: Class
subclass of: Shopping and service
comment: Le istanze di questa classe rappresentano, tra tutte le attività d'impresa, talune attività di commercio al dettaglio ambulante di tessuti, articoli tessili per la casa, articoli di abbigliamento, calzature e pelletterie. @it
comment: The instances of this class represent, among all the business activities, certain street retailing business of textiles, home textiles, clothing, footwear and leather goods.
label: Vendita Ambulante Abbigliamento e Calzature @it

Stalls and Markets of Food
type: Class
subclass of: Shopping and service
comment: Le istanze di questa classe rappresentano, tra tutte le attività d'impresa, talune attività di commercio al dettaglio ambulante di prodotti alimentari e bevande, prodotti ortofrutticoli, prodotti ittici e carni. @it
comment: The instances of this class represent, among all business activities, some street retailing business of foodstuffs and beverages, fruit and vegetables, fish products and meats.
label: Vendita Ambulante Alimentari @it

Stalls and Markets Other Goods
type: Class
subclass of: Shopping and service
comment: Le istanze di questa classe rappresentano, tra tutte le attività d'impresa, talune attività di commercio al dettaglio ambulante di macchine, attrezzature e prodotti per l'agricoltura, attrezzature per il giardinaggio, chincaglieria, bigiotteria, arredamenti per giardino, mobili, tappeti, stuoie, articoli casalinghi, elettrodomestici, materiale elettrico, profumi e cosmetici, saponi, detersivi ed altri detergenti per qualsiasi uso, fiori, piante, bulbi, semi e fertilizzanti. @it
comment: The instances of this class represent, among all the business activities, certain street retailing business of machinery, equipment and products for agriculture, gardening equipment, trinkets, jewelery, garden furniture, furniture, carpets, Mats, household items, household appliances, electrical equipment, perfumes and cosmetics, soaps, detergents and other detergents for any use, flowers, plants, bulbs, seeds and fertilizers.
label: Vendita Ambulante Altri Prodotti @it

Stamps and Coins
type: Class
subclass of: Shopping and service
comment: Le istanze di questa classe rappresentano, tra tutte le attività d'impresa, talune attività di commercio al dettaglio di filatelia, numismatica e articoli da collezionismo. @it
comment: The instances of this class represent, among all the business activities, certain pharmacy, numismatics and collectibles retail activities.
label: Filatelia e Numismatica @it

StatisticalData
type: Class
comment: Valore che fa riferimento ad un dato statistico legato ad una strada o ad una Pa. @it
comment: Value referring to a statistical data linked to a road or to a Public Administration.
label: Dato statistico @it

Stone Processing
type: Class
subclass of: Industry and manufacturing
comment: Le istanze di questa classe rappresentano, tra tutte le attività d'impresa, talune attività di frantumazione di pietre e minerali vari non in connessione con l'estrazione, segagione e lavorazione delle pietre e del marmo, lavorazione artistica del marmo e di altre pietre affini, lavori in mosaico, taglio, modellatura e finitura di pietre. @it
comment: The instances of this class represent, among all the business activities, certain mining activities of various stones and minerals not related to the extraction, segagion and processing of stones and marble, artistic marble processing and other related stones , Mosaic work, cutting, molding and finishing of stones.
label: Lavorazione Pietra @it

Street Number
type: Class
subclass of: Restriction
  on property: Belong to road
  qualified cardinality: 1
  on class: Road
comment: Class whose instances are known civic numbers.
comment: Classe le cui istanze sono i numeri civici conosciuti. @it
label: Numero Civico @it

Street light
type: Class
subclass of: Environment
comment: Ciascuna istanza di questa classe rappresenta un lampione del sistema di illuminazione stradale. @it
comment: Each instance of this class represents a lamppost of the street lighting system.
label: Lampione @it

Street sweeping
type: Class
subclass of: Environment
comment: Le istanze di questa classe rappresentano, tra tutte le attività d'impresa, talune attività di pulizia e lavaggio di aree pubbliche, rimozione di neve e ghiaccio. @it
comment: The instances of this class include, among all the business activities, some cleaning and washing activities in public areas, removal of snow and ice.
label: Pulizia aree pubbliche e strade @it

Subway station
type: Class
subclass of: Transfer service and renting
comment: Le istanze di questa classe rappresentano, tra tutte le sedi di servizi, talune stazioni della metropolitana. @it
comment: The instances of this class represent, at all service locations, some subway stations.
label: Stazione della metropolitana @it

Summer camp
type: Class
subclass of: Accommodation
comment: Le istanze di questa classe rappresentano, tra tutte le attività d'impresa, talune attività di colonie marine e montane. @it
comment: The instances of this class represent, among all the business activities, certain activities of marine and mountain colonies.
label: Colonie per ragazzi @it

Summer residence
type: Class
subclass of: Accommodation
subclass of: Residence
comment: Le istanze di questa classe rappresentano, tra tutte le sedi di servizi, talune case vacanza. @it
comment: The instances of this class represent, among all service locations, some holiday homes.
label: casa per vacanze @it

Supermarket
type: Class
subclass of: Shopping and service
comment: Le istanze di questa classe rappresentano, tra tutte le attività d'impresa, taluni supermercati. @it
comment: The instances of this class represent, among all business activities, some supermarkets.
label: Supermercato @it

Support Activities for Transportation
type: Class
subclass of: Transfer service and renting
comment: Le istanze di questa classe rappresentano, tra tutte le attività d'impresa, taluni servizi connessi al trasporto terrestre, aereo, marittimo, e per vie d'acqua. @it
comment: The instances of this class represent, among all business activities, certain services related to land, air, sea, and waterways transport.
label: Attivita' di Supporto ai trasporti @it

Support Animal Production
type: Class
subclass of: Agriculture and livestock
comment: Le istanze di questa classe rappresentano, tra tutte le attività d'impresa, talune attività di supporto all'allevamento, tra cui in particolare coltivazioni agricole associate all'allevamento di animali, attività di supporto alla produzione vegetale e animale, attività di supporto all'agricoltura e attività successive alla raccolta. @it
comment: The instances of this class represent, among all the business activities, certain support activities for farming, including in particular agricultural crops associated with animal breeding, plant and animal production support activities, agriculture and subsequent collection activities.
label: Supporto Produzione Animali @it

Surgical activities
type: Class
subclass of: Health Care
comment: Le istanze di questa classe rappresentano, tra tutte le attività d'impresa, talune attività di chirurgia. @it
comment: The demands of this class include, among all business activities, certain surgical activities.
label: Attività chirurgiche @it

Surveyor
type: Class
subclass of: Civil and edil engineering
comment: Le istanze di questa classe rappresentano, tra tutte le attività d'impresa, talune attività tecniche svolte da geometri. @it
comment: The instances of this class represent, among all the business activities, certain technical activities carried out by geometers.
label: Geometri @it

Sushi bar
type: Class
subclass of: Wine And Food
comment: Le istanze di questa classe rappresentano, tra tutte le attività d'impresa, alcuni sushi bar. @it
comment: The instances of this class represent, among all business activities, some sushi bars.

Take Away
type: Class
subclass of: Wine And Food
comment: Le istanze di questa classe rappresentano, tra tutte le attività d'impresa, talune attività di ristorazione senza somministrazione con preparazione di cibi da asporto. @it
comment: The instances of this class represent, among all the business activities, certain catering activities (without provision) for preparation of takeaway foods.

Tannery
type: Class
subclass of: Industry and manufacturing
comment: Le istanze di questa classe rappresentano, tra tutte le attività d'impresa, talune attività di preparazione e concia del cuoio, fabbricazione di articoli da viaggio, borse, pelletteria e selleria, preparazione e tintura di pellicce. @it
comment: The instances of this class include, among all the business activities, certain tanning activities of leather, manufacture of travel articles, handbags, leather goods and saddlery, fur preparation and dyeing.
label: Conceria @it

Tattoo and piercing
type: Class
subclass of: Shopping and service
comment: Le istanze di questa classe rappresentano, tra tutte le attività d'impresa, talune attività di tatuaggio e piercing. @it
comment: The instances of this class represent, among all the business activities, some tattoo and piercing activities.
label: Tatuaggio e piercing @it

Tax advice
type: Class
subclass of: Financial Service
comment: Le istanze di questa classe rappresentano, tra tutte le attività d'impresa, talune attività svolte dai Centri di assistenza fiscale. @it
comment: The instances of this class represent, among all business activities, certain activities carried out by Tax Assistance Centers.
label: Centri assistenza fiscale (CAF) @it

Taxi Company
type: Class
subclass of: Transfer service and renting
comment: Le istanze di questa classe rappresentano, tra tutte le attività d'impresa, talune attività di trasporto con taxi. @it
comment: The instances of this class represent, among all business activities, some taxi transport activities.
label: Taxi @it

Taxi park
type: Class
subclass of: Transfer service and renting
comment: Le istanze di questa classe rappresentano, tra tutte le sedi di servizi, talune aree di sosta per i taxi. @it
comment: The instances of this class represent, among all service locations, certain parking areas for taxis.
label: Aree sosta taxi @it

Technical consultants
type: Class
subclass of: Civil and edil engineering
comment: Le istanze di questa classe rappresentano, tra tutte le attività d'impresa, talune attività degli studi di architettura, ingegneria ed altri studi tecnici. @it
comment: The instances of this class represent, among all business activities, certain activities of architecture, engineering and other engineering studies.
label: Studi Tecnici @it

Technical testing
type: Class
subclass of: Industry and manufacturing
comment: Le istanze di questa classe rappresentano, tra tutte le attività d'impresa, talune attività di collaudo ed analisi tecniche. @it
comment: The instances of this class represent, among all the business activities, certain testing and technical analysis activities.
label: Collaudi tecnici @it

Telecommunications
type: Class
subclass of: Shopping and service
comment: Le istanze di questa classe rappresentano, tra tutte le attività d'impresa, talune attività di commercio al dettaglio di apparecchiature per le telecomunicazioni e la telefonia in esercizi specializzati. @it
comment: The instances of this class represent, among all business activities, certain retail trade activities of telecommunications equipment and telephony in specialized stores.
label: Telefonia e Telecomunicazioni @it

Television broadcasting
type: Class
subclass of: Cultural Activity
comment: Le istanze di questa classe rappresentano, tra tutte le attività d'impresa, talune attività di programmazione e trasmissioni televisive. @it
comment: The instances of this class represent, among all the business activities, certain activities of television programming and broadcasting.
label: Emittenti Televisive @it

Temp agency
type: Class
subclass of: Utilities and supply
comment: Le istanze di questa classe rappresentano, tra tutte le attività d'impresa, talune attività delle agenzie di fornitura di lavoro temporaneo (interinale). @it
comment: The instances of this class represent, among all the business activities, certain activities of the temporary employment agency.
label: Agenzie Interinali @it

Textile Manufacturing
type: Class
subclass of: Industry and manufacturing
comment: Le istanze di questa classe rappresentano, tra tutte le attività d'impresa, talune attività di manifattura tessile, tra cui in particolare: fabbricazione di spago, corde, funi e reti; fabbricazione di tulle, pizzi e merletti; confezionamento di articoli tessili (esclusi gli articoli di abbigliamento); fabbricazione di feltro e articoli tessili diversi; fabbricazione di tessuti non tessuti e di articoli in tali materie (esclusi gli articoli di abbigliamento); fabbricazione di ricami; fabbricazione di tappeti e moquette; finissaggio dei tessili, degli articoli di vestiario e attività similari; preparazione e filatura di fibre tessili; tessitura; confezionamento di biancheria da letto, da tavola e per l'arredamento; fabbricazione di tessuti a maglia; fabbricazione di nastri, etichette e passamanerie di fibre tessili. @it
comment: The instances of this class represent, among all the business activities, certain textile manufacturing activities, including: manufacture of twine, string, ropes and nets; manufacture of tulle, lace and lace; packaging of textile articles (excl. articles of clothing); manufacture of felt and textile articles diverse; manufacture of nonwovens and articles thereof (excl. articles of apparel); manufacture of embroidery; manufacture of carpets and carpets; finishing of textiles, of articles of changing room and similari activities; preparation and spinning of textile fibers; weaving; confezionamento of biancheria of bed, of table and for the amoblamiento; manufacture of knitted fabrics; manufacture of ribbons, labels and trimmings of textile fibers.
label: Produzione Tessile @it

Textiles Products
type: Class
subclass of: Shopping and service
comment: Le istanze di questa classe rappresentano, tra tutte le attività d'impresa, talune attività di commercio al dettaglio di prodotti tessili. @it
comment: The instances of this class represent, among all the business activities, certain retail trade activities of textile products.
label: Prodotti Tessili @it

Theatre
type: Class
subclass of: Cultural Activity
comment: Le istanze di questa classe rappresentano, tra tutte le attività d'impresa, talune attività teatrali, tra cui in particolare: attività nel campo della regia; altre attività di supporto alle rappresentazioni artistiche; gestione di teatri, sale da concerto e altre strutture artistiche; attività nel campo della recitazione; creazioni artistiche e letterarie; rappresentazioni artistiche; noleggio con operatore di strutture ed attrezzature per manifestazioni e spettacoli. @it
comment: The instances of this class include, among all the business activities, certain theatrical activities, including in particular: activities in the field of directing; other activities supporting artistic representations; management of theaters, concert halls and other artistic structures; activities in the field of acting; artistic and literary creations; artistic representations; rental with operator of structures and equipment for events and shows.
label: Teatro @it

Thermometry observation
type: Class
subclass of: Observation
comment: Ciascuna istanza di questa classe rappresenta una rilevazione della temperatura eseguita in un certo luogo ad un certo istante di tempo.
label: Rilevazione della temperatura @it

Ticket sale
type: Class
subclass of: Tourism Services
comment: Le istanze di questa classe rappresentano, tra tutte le attività d'impresa, taluni servizi di biglietteria per eventi teatrali, sportivi ed altri eventi ricreativi e d'intrattenimento. @it
comment: The instances of this class represent, among all business activities, certain ticketing services for theatrical, sports and other recreational and entertainment events.
label: Rivendita biglietti @it

Tobacco Industry
type: Class
subclass of: Industry and manufacturing
comment: Le istanze di questa classe rappresentano, tra tutte le attività d'impresa, talune industrie del tabacco. @it
comment: The instances of this class represent, among all the business activities, certain tobacco industries.
label: Industria del Tabacco @it

Tobacco shop
type: Class
subclass of: Shopping and service
comment: Le istanze di questa classe rappresentano, tra tutte le attività d'impresa, talune attività di commercio al dettaglio di generi di monopolio (tabaccherie). @it
comment: The instances of this class represent, among all the business activities, certain retail trade activities of monopolies (tobaccos).
label: Tabaccheria @it

Toilet
type: Class
subclass of: Tourism Services
comment: Le istanze di questa classe rappresentano, tra tutte le sedi di servizi, taluni servizi igienici pubblici, da inquadrare nel contesto dei servizi turistici. @it
comment: The instances of this class represent, among all the services, some public toilets, to be framed in the context of tourist services.
label: Bagno @it

Tour operator
type: Class
subclass of: Tourism Services
comment: Le istanze di questa classe rappresentano, tra tutte le attività d'impresa, talune attività delle agenzie di viaggi. @it
comment: The instances of this class represent, among all business activities, certain activities of travel agencies.

Tourism Services
type: Class
subclass of: Service
comment: Activities of travel agency services, tour operators and booking services.
comment: Attività dei servizi delle agenzie di viaggio, tour operator e servizi prenotazione. @it
label: Servizi per il turismo @it

Tourist complaints office
type: Class
subclass of: Tourism Services
comment: Le istanze di questa classe rappresentano, tra tutte le sedi di servizi, taluni uffici reclami dedicati al comparto turistico. @it
comment: The instances of this class represent, among all service locations, certain complaint offices dedicated to the tourism sector.
label: Uffici Reclami Turistici @it

Tourist guides
type: Class
subclass of: Tourism Services
comment: Le istanze di questa classe rappresentano, tra tutte le attività d'impresa, talune attività delle guide e degli accompagnatori turistici. @it
comment: The instances of this class represent, among all the business activities, certain activities of guides and tour guides.
label: Guide Turistiche @it

Tourist information office
type: Class
subclass of: Tourism Services
comment: Le istanze di questa classe rappresentano, tra tutte le sedi di servizi, taluni uffici di informazione turistica. @it
comment: The instances of this class represent, among all service locations, some tourist information offices.
label: Ufficio Informazioni Turistiche @it

tourist trail
type: Class
subclass of: Tourism Services
comment: Le istanze di questa classe rappresentano, tra tutte le sedi di servizi, taluni itinerari turistici. @it
comment: The instances of this class represent, among all service locations, certain tourist itineraries.
label: Itinerario turistico @it

Towing and Roadside Assistance
type: Class
subclass of: Emergency
comment: Le istanze di questa classe rappresentano, tra tutte le attività d'impresa, talune attività di traino e soccorso stradale. @it
comment: The instances of this class represent, among all the business activities, some towing and roadside assistance activities.
label: Traino e Soccorso Stradale @it

Traffic Concentration Observation
type: Class
subclass of: Traffic observation
subclass of: Restriction
  on property: Concentration
  qualified cardinality: 1
  on data range: string
comment: Sottoclasse delle osservazioni relative alla concentrazione di auto. @it
comment: Subclass of observations on auto concentration.
label: Osservazione sulla concentrazione di auto @it

Traffic Headway Observation
type: Class
subclass of: Traffic observation
subclass of: Restriction
  on property: Average time
  qualified cardinality: 1
  on data range: string
comment: Sottoclasse delle osservazioni sul tempo medio di transito tra auto. @it
comment: Sub-class of observations on the average transit time between cars.
label: Osservazione sulla densità di auto @it

Traffic observation
type: Class
subclass of: Observation
comment: Ciascuna istanza di questa classe rappresenta una rilevazione del traffico eseguita in un certo luogo ad un certo tempo. @it
comment: Each instance of this class represents a traffic detection performed at some point at some time.
label: Rilevazione del traffico @it

TrafficSpeed Observation
type: Class
subclass of: Traffic observation
subclass of: Restriction
  on property: Average speed
  qualified cardinality: 1
  on data range: string
comment: Sottoclasse delle osservazioni relative alla velocità media. @it
comment: Subclass of average velocity observations.
label: Osservazione sulla velocità. @it

Traffic corps
type: Class
subclass of: Emergency
comment: Ciascuna istanza di questa classe rappresenta un posto di Polizia Stradale. @it
comment: Each instance of this class represents a Street Police Station.
label: Polizia stradale @it

Traffic flasher
type: Class
subclass of: Transfer service and renting
label: Lampeggiatore di traffico @it

Traffic Flow Observation
type: Class
subclass of: High level type
subclass of: Transfer service and renting
comment: Sottoclasse delle osservazioni relative alla flusso auto. @it
comment: Subclass of auto flow observations.
label: Osservazione sul flusso @it

Traffic light
type: Class
subclass of: Transfer service and renting
subclass of: CityObject
comment: Le istanze di questa classe rappresentano ciascuna un impianto semaforico. @it
comment: The instances of this class are each a semaphorical facility.
label: Semaforo @it

Traffic sensor
type: Class
label: Sensore del traffico @it
subclass of: Transfer service and renting
comment: Single sensor for observing speed, traffic, concentration or density
comment: Singolo sensore per osservare velocità, traffico, concentrazione o densità @it

Train Station
type: Class
subclass of: StopPoint
subclass of: SpatialThing
subclass of: Restriction
  on property: Correspond to junction
  qualified cardinality: 1
  on class: Railway Junction
comment: Railway station, are located at railway junctions with a ratio of 1:1
comment: Stazione ferroviaria, sono posizionate in corrispondenza di giunzioni ferroviarie con relazione 1:1 @it
label: Stazione Ferroviaria @it

Train lost property office
type: Class
subclass of: Government Office
comment: Le istanze di questa classe rappresentano, tra tutte le sedi di servizi, taluni uffici oggetti smarriti nelle stazioni dei treni. @it
comment: The instances of this class represent, among all service locations, some offices for the lost items located inside train stations.
label: Ufficio oggetti smarriti stazione treno @it

Train station
type: Class
subclass of: Transfer service and renting
comment: Le istanze di questa classe rappresentano, tra tutte le sedi di servizi, talune stazioni ferroviarie. @it
comment: The instances of this class represent, at all service locations, some railway stations.
label: Stazione ferroviaria @it

Training school
type: Class
subclass of: EducationAndResearch
comment: Le istanze di questa classe rappresentano, tra tutte le attività d'impresa, taluni corsi di formazione e corsi di aggiornamento professionale. @it
comment: The instances of this class represent, among all business activities, some training courses and professional updating courses.
label: Formazione e aggiornamento professionale @it

Training school for teachers
type: Class
subclass of: EducationAndResearch
comment: Le istanze di questa classe rappresentano, tra tutte le sedi di servizi, taluni istituti magistrali. @it
comment: The instances of this class represent, among all service locations, some master schools.
label: Istituti magistrali @it

Trajectory path
type: Class
subclass of: High level type
comment: Entity that rappresents a trajectory path
comment: Entità che rappresenta il percorso di una traiettoria @it
label: Percorso di traiettoria @it

Tram stops
type: Class
subclass of: Transfer service and renting
comment: Le istanze di questa classe rappresentano, tra tutte le sedi di servizi, talune fermate del tram. @it
comment: The instances of this class represent, at all service locations, some tram stops.
label: Fermate del tram @it

Tram traffic light
type: Class
subclass of: Transfer service and renting
label: Semaforo per tram @it

Tram line
type: Class
subclass of: Transfer service and renting
comment: Le istanze di questa classe rappresentano, tra tutte le sedi di servizi, talune linee del tram. @it
comment: The instances of this class represent, among all service locations, some tram lines.
label: Linea del Tram @it

Transfer service and renting
type: Class
subclass of: Service
comment: Car parks, railway stations or buses, everything that must be located on a map and refers to transportation.
comment: Parcheggi auto, stazioni ferroviarie o degli autobus, tutto ciò che deve essere localizzato su una mappa e fa riferimento al trasporto. @it
label: Servizio di trasferimento e noleggio @it

Translation and interpreting
type: Class
subclass of: Cultural Activity
comment: Le istanze di questa classe rappresentano, tra tutte le attività d'impresa, talune attività di traduzione e interpretariato. @it
comment: The instances of this class represent, among all the business activities, some translation and interpretation activities.
label: Traduttori e interpreti @it

Transverse Service
type: Class
subclass of: Service
comment: Services often associated with other services, which have their own geolocation.
comment: Servizi molto spesso collegati ad altri servizi, che presentano una loro geolocalizzazione. @it
label: Servizio Trasversale @it

Trattoria
type: Class
subclass of: Wine And Food
comment: Le istanze di questa classe rappresentano, tra tutte le attività d'impresa, talune trattorie. @it
comment: The instances of this class represent, among all the business activities, some trattorias.

Travel agency
type: Class
subclass of: Tourism Services
comment: Le istanze di questa classe rappresentano, tra tutte le attività d'impresa, talune agenzie di viaggio. @it
comment: The instances of this class represent, among all business activities, some travel agencies.
label: Agenzia di viaggio @it

Travel bureau
type: Class
subclass of: Tourism Services
comment: Le istanze di questa classe rappresentano, tra tutte le sedi di servizi, taluni uffici del comparto turistico dedicati alle visite guidate. @it
comment: The instances of this class represent, among all service locations, some tourist offices dedicated to guided tours.
label: Ufficio visite guidate @it

Travel goods
type: Class
subclass of: Shopping and service
comment: Le istanze di questa classe rappresentano, tra tutte le attività d'impresa, talune attività di commercio al dettaglio di articoli di pelletteria e da viaggio. @it
comment: The instances of this class represent, among all business activities, certain retail trade of leather goods and travel goods.
label: Articoli da Viaggio @it

Travel information
type: Class
subclass of: Tourism Services
comment: Le istanze di questa classe rappresentano, tra tutte le attività d'impresa, taluni servizi resi dalle agenzie di viaggio e dai tour operator, i servizi di prenotazione, i servizi di interesse turistico resi da soggetti diversi dalle agenzie di viaggio e dai tour operator, e le attività connesse. @it
comment: The instances of this class represent, among all business activities, certain services provided by travel agencies and tour operators, booking services, services of tourist interest made by subjects other than travel agencies and tour operators, and related activities.
label: Assistenza Turistica @it

Trinkets
type: Class
subclass of: Shopping and service
comment: Le istanze di questa classe rappresentano, tra tutte le attività d'impresa, talune attività di commercio al dettaglio di chincaglieria e bigiotteria (inclusi gli oggetti ricordo e gli articoli di promozione pubblicitaria). @it
comment: The instances of this class represent, among all the business activities, certain retail trade of trinkets and jewelery (including souvenirs and promotional items).
label: Bigiotteria @it

Turn restriction
type: Class
subclass of: Restriction
comment: Le istanze di questa classe rappresentano ciascuna una restrizione di svolta. @it
comment: The instances of this class represent each a turn restriction.
label: Restrizioni di svolta @it

Underpass
type: Class
subclass of: Transfer service and renting
label: Sottopassaggio @it

Underwear, Knitwear and Shirts
type: Class
subclass of: Shopping and service
comment: Le istanze di questa classe rappresentano, tra tutte le attività d'impresa, talune attività di commercio al dettaglio di biancheria personale, maglieria, camicie. @it
comment: The instances of this class represent, among all the business activities, some retail business of personal linen, knitwear, shirts.
label: Biancheria Maglieria Camicie @it

Upholsterer
type: Class
subclass of: Shopping and service
comment: Le istanze di questa classe rappresentano, tra tutte le attività d'impresa, taluni laboratori di tappezzeria. @it
comment: The instances of this class represent, among all the business activities, some upholstery workshops.
label: Tappezzerie @it

Urban bus
type: Class
subclass of: Transfer service and renting
comment: Le istanze di questa classe rappresentano, tra tutte le sedi di servizi, le sedi di talune società di trasporto pubblico locale che operano su area urbana. @it
comment: The instances of this class represent, among all service locations, the locations of certain local public transport companies operating on urban areas.
label: Autobus urbani @it

Urban furniture
type: Class
subclass of: Transfer service and renting
subclass of: CityObject
comment: Le istanze di questa classe rappresentano un generico arredo urbano della città. @it
comment: The instances of this class represent a generic uban furniture of the city.
label: Arredo urbano @it

Useful numbers
type: Class
subclass of: Emergency
comment: Le istanze di questa classe rappresentano i numeri da chiamare in caso di emergenza. @it
comment: The instances of this class represent the numbers to be called in an emergency.
label: Numeri utili @it

Utilities and supply
type: Class
subclass of: Service
comment: Each instance of this class represents an utility or supply service.
comment: Fornitura di utenze e servizi. @it
label: Forniture di servizi @it

Vacating service
type: Class
subclass of: Shopping and service
comment: Le istanze di questa classe rappresentano, tra tutte le attività d'impresa, talune attività di sgombero di cantine, solai e garage. @it
comment: The instances of this class represent, among all business activities, certain activities of clearing cellars, floors and garages.
label: Sgombero di cantine, solai e garage @it

Vacation resort
type: Class
subclass of: Accommodation
comment: Le istanze di questa classe rappresentano, tra tutte le sedi di servizi, taluni residence di villeggiatura. @it
comment: The instances of this class represent, among all service locations, some holiday resorts.
label: Residence di villeggiatura @it

Variable message sign
type: Class
subclass of: Transfer service and renting
label: Pannello a messaggio variabile @it

Vehicle rental
type: Class
subclass of: Transfer service and renting
comment: Le istanze di questa classe rappresentano, tra tutte le sedi di servizi, taluni servizi di noleggio veicoli. @it
comment: The instances of this class represent, among all service locations, certain vehicle rental services.
label: Noleggio veicoli @it

Vehicle trade
type: Class
subclass of: Shopping and service
comment: Questa classe rappresenta, tra tutte le attività d'impresa, le attività di compravendita di veicoli. @it
comment: This class represents, among all business activities, the business of buying and selling vehicles.
label: Rivendita autoveicoli @it

Vending Machines
type: Class
subclass of: Shopping and service
comment: Le istanze di questa classe rappresentano, tra tutte le attività d'impresa, talune attività di commercio al dettaglio effettuato per mezzo di distributori automatici. @it
comment: The instances of this class represent, among all business activities, certain retail activities carried out by automated vending machines.
label: Distributori Automatici @it

Veterinary
type: Class
subclass of: Agriculture and livestock
comment: Le istanze di questa classe rappresentano, tra tutte le attività d'impresa, taluni servizi veterinari. @it
comment: The demands of this class represent, among all business activities, certain veterinary services.
label: Veterinari @it

Video tapes disks rental
type: Class
subclass of: Utilities and supply
comment: Le istanze di questa classe rappresentano, tra tutte le attività d'impresa, talune attività di noleggio di videocassette, cd, dvd e dischi contenenti audiovisivi o videogame. @it
comment: The instances of this class represent, among all business activities, some hire of video cassettes, CDs, DVDs and discs containing audiovisual or video games.
label: Noleggio audiovisivi @it

Viewpoint
type: Class
subclass of: Entertainment
comment: Ciascuna istanza di questa classe rappresenta un punto panoramico. @it
comment: Each instance of this class represents a viewpoint. @it
label: Punto panoramico @it

Wallpaper and Floor Coverings
type: Class
subclass of: Shopping and service
comment: Le istanze di questa classe rappresentano, tra tutte le attività d'impresa, talune attività di commercio al dettaglio di carta da parati e rivestimenti per pavimenti (moquette e linoleum). @it
comment: The instances of this class represent, among all business activities, some retail business of wallpaper and floor coverings (carpet and linoleum).
label: Carta da Parati Rivestimento Pavimenti @it

Warehousing and Storage
type: Class
subclass of: Transfer service and renting
comment: Le istanze di questa classe rappresentano, tra tutte le attività d'impresa, talune attività di magazzinaggio e custodia, ed in particolare: magazzinaggio e custodia; magazzinaggio e attività di supporto ai trasporti; magazzini frigoriferi per conto terzi; magazzini di custodia e deposito per conto terzi. @it
comment: The instances of this class represent, among all business activities, certain storage and custody activities, and in particular: storage and custody; warehousing and transport support activities; refrigerated warehouses for third parties; warehouses of custody and deposit for third account.
label: Magazzini e Custodia @it

Waste container type
type: Class
comment: Ciascuna istanza di questa classe rappresenta una in particolare tra le diverse tipologie di contenitori per i rifiuti (indifferenziati, carta, plastica, vetro, farmaci e così via). @it
comment: Each instance of this class represents a particular type of waste container (undifferentiated, paper, plastic, glass, drugs, and so on).
label: Tipologia di contenitore per i rifiuti @it

Waste Collection and Treatment
type: Class
subclass of: Environment
comment: Le istanze di questa classe rappresentano, tra tutte le attività d'impresa, talune attività di raccolta, trattamento e smaltimento dei rifiuti. @it
comment: The instances of this class represent, among all business activities, certain waste collection, treatment and disposal activities.
label: Raccolta Trattamento Rifiuti @it

Waste container
type: Class
subclass of: Waste Collection and Treatment
comment: Ciascuna istanza di questa classe rappresenta un cassonetto per i rifiuti. @it
comment: Each instance of this class represents a waste bin.
label: Cassonetto spazzatura @it

Water Collection Treatment and Supply
type: Class
subclass of: Utilities and supply
comment: Le istanze di questa classe rappresentano, tra tutte le attività d'impresa, talune attività di raccolta, trattamento e fornitura di acqua. @it
comment: The instances of this class represent, among all business activities, certain activities of gathering, treating and supplying water.
label: Raccolta Fornitura Trattamento Acqua @it

Water resource
type: Class
subclass of: Environment
comment: Ciascuna istanza di questa classe rappresenta una società o un ente di gestione delle risorse idriche. @it
comment: Each instance of this class represents a water resource company or entity.
label: Risorse idriche @it

Water Transport
type: Class
subclass of: Transfer service and renting
comment: Le istanze di questa classe rappresentano, tra tutte le attività d'impresa, talune attività di trasporto di passeggeri marittimo, costiero e per vie d'acqua interne. @it
comment: The instances of this class represent, among all the business activities, certain maritime, coastal and inland waterway transport activities.
label: Trasporto Marittimo e Fluviali @it

Weapons and Ammunition
type: Class
subclass of: Shopping and service
comment: Le istanze di questa classe rappresentano, tra tutte le attività d'impresa, talune attività di commercio al dettaglio di armi, munizioni e articoli militari. @it
comment: The instances of this class represent, among all business activities, certain retail trade activities of weapons, ammunition and military articles.
label: Armi e Munizioni @it

Weather prediction
type: Class
comment: Meteorological forecast for a specific part of the day.
comment: Previsione metereologica relativa ad una specifica parte del giorno. @it
label: Previsione metereologica @it

Weather Report
type: Class
subclass of: Restriction
  on property: Refers to municipality
  qualified cardinality: 1
  on class: Municipality Administration
comment: Bollettino metereologico con informazioni relative a temperatura, umidità, neve e così via. @it
comment: Meteorological report with information on temperature, humidity, snow and the like.
label: Bollettino metereologico @it

Weather sensor
type: Class
subclass of: Environment
comment: Sensore meteo che rilascia informazioni sulle previsioni meteo. @it
comment: Weather sensor releasing information on weather forecasts.
label: Sensori meteo @it

Web and Internet Provider
type: Class
subclass of: Industry and manufacturing
comment: Le istanze di questa classe rappresentano, tra tutte le attività d'impresa, talune attività di hosting e fornitura di servizi applicativi, inclusi i portali Web. @it
comment: The instances of this class represent, among all business activities, some hosting and provision of application services, including Web portals.
label: Web e Internet Provider @it

Wedding Favors
type: Class
subclass of: Shopping and service
comment: Le istanze di questa classe rappresentano, tra tutte le attività d'impresa, talune attività di commercio al dettaglio di bomboniere. @it
comment: The instances of this class represent, among all business activities, certain candy-shop retail activities.
label: Bomboniere @it

Welfare worker office
type: Class
subclass of: Government Office
comment: Le istanze di questa classe rappresentano, tra tutte le sedi di servizi, taluni uffici degli assistenti sociali. @it
comment: The instances of this class represent, among all service locations, certain offices of social workers.
label: Assistenti sociali uffici @it

Wellness centre
type: Class
subclass of: Shopping and service
comment: Le istanze di questa classe rappresentano, tra tutte le attività d'impresa, talune attività dei centri per il benessere fisico e degli stabilimenti termali. @it
comment: The instances of this class represent, among all business activities, certain activities of centers for physical well-being and spa facilities.
label: Centri benessere @it

Wholesale
type: Class
subclass of: Service
comment: Vendita all'ingrosso di qualsiasi cosa. @it
comment: Wholesale of anything.
label: Vendita all'ingrosso @it

Wholesale Agricultural Raw Materials Live Animals
type: Class
subclass of: Wholesale
comment: Le istanze di questa classe rappresentano, tra tutte le attività d'impresa, talune attività di commercio all'ingrosso di prodotti animali e vegetali, tra cui: cereali e legumi secchi; animali vivi; cuoio e pelli gregge e lavorate (escluse le pelli per pellicceria); pelli gregge e lavorate per pellicceria; sementi e alimenti per il bestiame (mangimi), piante officinali, semi oleosi, patate da semina; cereali, tabacco grezzo, sementi e alimenti per il bestiame (mangimi); fiori e piante. @it
comment: The instances of this class represent, among all business activities, certain wholesale trade in animal and vegetable products, including: cereals and pulses; Live animals; Leather and raw hides and skins (excluding fur skins); Raw skins and furskins; Seeds and feed for livestock (feed), officinal plants, oilseeds, potatoes; Cereals, raw tobacco, seed and livestock feed (feed); flowers and plants.
label: Ingrosso Materie Prime Agricole e Animali @it

Wholesale Commission Trade
type: Class
subclass of: Wholesale
comment: Le istanze di questa classe rappresentano, tra tutte le attività d'impresa, talune attività di agenti e rappresentanti di commercio. @it
comment: The instances of this class represent, among all the business activities, certain activities of agents and trade representatives.
label: Intermediari Commercio Ingrosso @it

Wholesale Food Beverages Tobacco
type: Class
subclass of: Wholesale
comment: Le istanze di questa classe rappresentano, tra tutte le attività d'impresa, talune attività di commercio all'ingrosso di prodotti alimentari e di prodotti del tabacco. @it
comment: The instances of this class represent, among all the business activities, certain activities of wholesale trade in food and tobacco products.
label: Ingrosso Alimenti Bevande Tabacco @it

Wholesale Household Goods
type: Class
subclass of: Wholesale
comment: Le istanze di questa classe rappresentano, tra tutte le attività d'impresa, talune attività di commercio all'ingrosso di prodotti non alimentari. @it
comment: The instances of this class represent, among all business activities, certain non-food wholesale trade activities.
label: Ingrosso Beni Cosumo @it

Wholesale ICT Equipment
type: Class
subclass of: Wholesale
comment: Le istanze di questa classe rappresentano, tra tutte le attività d'impresa, talune attività di commercio all'ingrosso di apparecchiature elettroniche, informatiche e similari. @it
comment: The instances of this class represent, among all business activities, certain wholesale activities of electronic, computer and similar equipment.
label: Ingrosso Apparecchiature ICT @it

Wholesale Machinery Equipmentent Supplies
type: Class
subclass of: Wholesale
comment: Le istanze di questa classe rappresentano, tra tutte le attività d'impresa, talune attività di commercio all'ingrosso di apparecchiature per uso professionale. @it
comment: The instances of this class represent, among all business activities, certain wholesale trade of professional equipment.
label: Ingrosso Apparecchiature Macchinari Forniture @it

Wholesale Motor Vehicles Parts
type: Class
subclass of: Wholesale
comment: Le istanze di questa classe rappresentano, tra tutte le attività d'impresa, talune attività di commercio all'ingrosso ed intermediazione di parti e accessori di autoveicoli. @it
comment: The instances of this class represent, among all business activities, certain wholesale and brokering activities of parts and accessories of motor vehicles.
label: Vendita Ingrosso Ricambi Autoveicoli @it

Wholesale Trade
type: Class
subclass of: Wholesale
comment: Le istanze di questa classe rappresentano, tra tutte le attività d'impresa, talune attività di commercio all'ingrosso. @it
comment: The instances of this class represent, among all business activities, certain wholesale activities.
label: Commercio Ingrosso @it

Free WiFi point
type: Class
subclass of: Tourism Services
comment: Le istanze di questa classe rappresentano, tra tutte le sedi di servizi, taluni punti di accesso a reti Wi-fi. @it
comment: The instances of this class represent, among all service locations, certain access points to Wi-Fi networks.
label: Punto di accesso alla WiFi @it

Wine And Food
type: Class
subclass of: Service
comment: Restaurants, wine bars and all other food and wine activities.
comment: Ristoranti, enoteche e tutte le altre attivita' enogastronomiche @it
label: Enogastronomia @it

Wine shop and wine bar
type: Class
subclass of: Wine And Food
comment: Le istanze di questa classe rappresentano, tra tutte le attività d'impresa, talune attività di commercio al dettaglio di bevande. @it
comment: The instances of this class represent, among all business activities, certain beverage retail activities.
label: Enoteche e wine bar @it

Youth assistance
type: Class
subclass of: Health Care
comment: Le istanze di questa classe rappresentano, tra tutte le sedi di servizi, talune sedi dei centri di assistenza ai minori. @it
comment: The instances of this class represent, among all service locations, some childcare centers.
label: Assistenza minori @it

Youth information centre
type: Class
subclass of: Government Office
comment: Le istanze di questa classe rappresentano, tra tutte le sedi di servizi, taluni uffici Informa Giovani. @it
comment: The instances of this class represent, among all service locations, certain youth information centres.
label: Informa Giovani @it

Area
type: Class
subclass of: BuildingSpace
comment: A Site can be divided in areas.

ChemicalCompound
type: Class
subclass of: Flow
comment: Any sort of Chemical Compounds that flow between Physical Object,

Energy
type: Class
subclass of: Flow
comment: Any sort of Energy used or producted by a Phisycal Object.

Flow
type: Class
subclass of: Restriction
  on property: endIn
  all values from: PhysicalObject
subclass of: Restriction
  on property: startIn
  all values from: PhysicalObject
subclass of: Restriction
  on property: endIn
  min qualified cardinality: 1
  on class: PhysicalObject
subclass of: Restriction
  on property: startIn
  min qualified cardinality: 1
  on class: PhysicalObject
comment: A generic Flow from and to a Physical Object, usually achived with pipes.

ProductionLine
type: Class
subclass of: Restriction
  on property: containsFlow
  all values from: Flow
subclass of: Restriction
  on property: contains
  all values from: PhysicalObject
comment: A Production Line of an industry.

Site
type: Class
subclass of: BuildingSpace
comment: A Building can be divided in sites.

Water
type: Class
subclass of: Flow
subclass of: Restriction
  on property: waterPressureMax
  all values from: Measurement
subclass of: Restriction
  on property: waterPressureMin
  all values from: Measurement
comment: Water Flow from and to a Physical Object.

Feature
type: Class
comment: Classe esterna: http://schemas.opengis.net/geosparql/1.0/geosparql_vocab_all.rdf#Feature @it
comment: External class: http://schemas.opengis.net/geosparql/1.0/geosparql_vocab_all.rdf#Feature

Geometry
type: Class
comment: Classe esterna: http://www.opengis.net/ont/geosparql#Geometry @it
comment: External class: http://www.opengis.net/ont/geosparql#Geometry

Edge
type: Class
subclass of: Geometric
comment: Classe esterna: http://www.pms.ifi.uni-muenchen.de/OTN#Edge @it
comment: External class: http://www.pms.ifi.uni-muenchen.de/OTN#Edge

Dace
type: Class
subclass of: Geometric
comment: Classe esterna: http://www.pms.ifi.uni-muenchen.de/OTN#Face @it
comment: External class: http://www.pms.ifi.uni-muenchen.de/OTN#Face
label: Face @it

Geometric
type: Class
comment: Classe esterna: http://www.pms.ifi.uni-muenchen.de/OTN#Geometric @it
comment: External class: http://www.pms.ifi.uni-muenchen.de/OTN#Geometric

Line
type: Class
comment: Classe esterna: http://www.pms.ifi.uni-muenchen.de/OTN#Line @it
comment: External class: http://www.pms.ifi.uni-muenchen.de/OTN#Line

Manoeuver
type: Class
comment: Classe esterna: http://www.pms.ifi.uni-muenchen.de/OTN#Manoeuver @it
comment: External class: http://www.pms.ifi.uni-muenchen.de/OTN#Manoeuver

Node
type: Class
subclass of: Geometric
comment: Classe esterna: http://www.pms.ifi.uni-muenchen.de/OTN#Node @it
comment: External class: http://www.pms.ifi.uni-muenchen.de/OTN#Node

Road
type: Class
comment: Classe esterna: http://www.pms.ifi.uni-muenchen.de/OTN#Road @it
comment: External class: http://www.pms.ifi.uni-muenchen.de/OTN#Road

Road_Element
type: Class
comment: Classe esterna: http://www.pms.ifi.uni-muenchen.de/OTN#Road_Element @it
comment: External class: http://www.pms.ifi.uni-muenchen.de/OTN#Road_Element

Route
type: Class
comment: Classe externa: http://www.pms.ifi.uni-muenchen.de/OTN#Route @it
comment: External class: http://www.pms.ifi.uni-muenchen.de/OTN#Route

RouteSection
type: Class
comment: Classe esterna: http://www.pms.ifi.uni-muenchen.de/OTN#RouteSection @it
comment: External class: http://www.pms.ifi.uni-muenchen.de/OTN#RouteSection

Service
type: Class
comment: Classe esterna: http://www.pms.ifi.uni-muenchen.de/OTN#Service @it
comment: External class: http://www.pms.ifi.uni-muenchen.de/OTN#Service

StopPoint
type: Class
subclass of: Node
comment: Classe esterna: http://www.pms.ifi.uni-muenchen.de/OTN#StopPoint @it
comment: External class: http://www.pms.ifi.uni-muenchen.de/OTN#StopPoint

Bag
type: Class
comment: Contenitori non ordinati. @it

Seq
type: Class
comment: Contenitori ordinati. @it

Resource
type: Class
comment: Classe esterna: http://www.w3.org/2000/01/rdf-schema#Resource @it
comment: External class: http://www.w3.org/2000/01/rdf-schema#Resource

SpatialThing
type: Class
comment: Classe esterna: http://www.w3.org/2003/01/geo/wgs84_pos#SpatialThing @it
comment: External class: http://www.w3.org/2003/01/geo/wgs84_pos#SpatialThing

Instant
type: Class
comment: Classe esterna: http://www.w3.org/2006/time#Instant @it
comment: External class: http://www.w3.org/2006/time#Instant

TemporalEntity
type: Class
comment: Classe esterna: http://www.w3.org/2006/time#TemporalEntity @it
comment: External class: http://www.w3.org/2006/time#TemporalEntity

Organization
type: Class
comment: Classe esterna: http://xmlns.com/foaf/0.1/Organization @it
comment: External class: http://xmlns.com/foaf/0.1/Organization